BDBM50506236 4sc-201::BYK-408740::BYK408740::RAS-2410::RAS2410::Resminostat
SMILES CN(C)Cc1ccc(cc1)S(=O)(=O)n1ccc(\C=C\C(=O)NO)c1
InChI Key InChIKey=FECGNJPYVFEKOD-VMPITWQZSA-N
Data  4 IC50
PDB links: 2 PDB IDs match this monomer.
  Tab Delimited (TSV)   2D SDfile   Computed 3D by Vconf -m prep SDfile
Find this compound or compounds like it in BindingDB:
Activity Spreadsheet -- Enzyme Inhibition Constant Data from BindingDB
Found 4 hits for monomerid = 50506236
TargetHistone deacetylase 6(Homo sapiens (Human))
University Of Pennsylvania
Curated by ChEMBL
LigandPNGBDBM50506236(4sc-201 | BYK-408740 | BYK408740 | RAS-2410 | RAS2...)
Affinity DataIC50:  72nM. Assay description: Inhibition of recombinant C-terminal FLAG-tagged HDAC6 (unknown origin) using Ac-NH-GGK(Ac)-AMC as substrate measured after 180 mins by fluorescence ...
In DepthDetails ArticlePubMed
TargetHistone deacetylase 1(Homo sapiens (Human))
University Of Pennsylvania
Curated by ChEMBL
LigandPNGBDBM50506236(4sc-201 | BYK-408740 | BYK408740 | RAS-2410 | RAS2...)
Affinity DataIC50:  877nM. Assay description: Inhibition of C-terminal Flag-tagged HDAC1 (unknown origin) expressed in HEK293 cells or Sf21 cells using Ac-RHK(Ac)K(Ac)-AMC peptide as substrate me...
In DepthDetails ArticlePubMed
TargetHistone deacetylase 1(Homo sapiens (Human))
University Of Pennsylvania
Curated by ChEMBL
LigandPNGBDBM50506236(4sc-201 | BYK-408740 | BYK408740 | RAS-2410 | RAS2...)
Affinity DataIC50:  43nM. Assay description: Inhibition of C-terminal Flag-tagged HDAC1 (unknown origin) expressed in HEK293 cells or Sf21 cells using Ac-NH-GGK(Ac)-AMC peptide as substrate meas...
In DepthDetails ArticlePubMed
TargetHistone deacetylase 6(Homo sapiens (Human))
University Of Pennsylvania
Curated by ChEMBL
LigandPNGBDBM50506236(4sc-201 | BYK-408740 | BYK408740 | RAS-2410 | RAS2...)
Affinity DataIC50:  72nM. Assay description: Inhibition of C-terminal Flag-tagged HDAC6 (unknown origin) expressed in HEK293 cells or Sf21 cells using Ac-NH-GGK(Ac)-AMC peptide as substrate meas...
In DepthDetails ArticlePubMed