BDBM50506474 Ft-2102::Olutasidenib::US11311527, Cpd ID 1::US11376246, Compound 1::US11566013, Compound I-1
SMILES C[C@H](Nc1ccc(C#N)n(C)c1=O)c1cc2cc(Cl)ccc2[nH]c1=O
InChI Key InChIKey=NEQYWYXGTJDAKR-JTQLQIEISA-N
Data  32 IC50
PDB links: 1 PDB ID matches this monomer.
  Tab Delimited (TSV)   2D SDfile   Computed 3D by Vconf -m prep SDfile
Find this compound or compounds like it in BindingDB:
Activity Spreadsheet -- Enzyme Inhibition Constant Data from BindingDB
Found 32 hits for monomerid = 50506474
TargetIsocitrate dehydrogenase [NADP] cytoplasmic(Homo sapiens (Human))
Forma Therapeutics
Curated by ChEMBL
LigandPNGBDBM50506474(Ft-2102 | Olutasidenib | US11311527, Cpd ID 1 | US...)
Affinity DataIC50:  21nM. Assay description: Inhibition of IDH1 R132H mutant in human HCT116 cells assessed as reduction in 2-HG levels after 24 hrs by RapidFire high-throughput mass spectrometr...
TargetIsocitrate dehydrogenase [NADP] cytoplasmic [R132C](Homo sapiens (Human))
Forma Therapeutics
US Patent
LigandPNGBDBM50506474(Ft-2102 | Olutasidenib | US11311527, Cpd ID 1 | US...)
Affinity DataIC50:  114nM. Assay description: Compound 1 was not initially reported as having the greatest biochemical potency compared to reports for certain other small molecule inhibitors of m...
TargetIsocitrate dehydrogenase [NADP] cytoplasmic(Homo sapiens (Human))
Forma Therapeutics
Curated by ChEMBL
LigandPNGBDBM50506474(Ft-2102 | Olutasidenib | US11311527, Cpd ID 1 | US...)
Affinity DataIC50:  9nM. Assay description: Inhibition of human Myc-DDK-tagged IDH1 R132H mutant expressed in human U87MG cells assessed as reduction in 2-HG levels after 24 hrs by rapidfire hi...
TargetIsocitrate dehydrogenase [NADP] cytoplasmic(Homo sapiens (Human))
Forma Therapeutics
Curated by ChEMBL
LigandPNGBDBM50506474(Ft-2102 | Olutasidenib | US11311527, Cpd ID 1 | US...)
Affinity DataIC50:  39nM. Assay description: Inhibition of human Myc-DDK-tagged IDH1 R132C mutant expressed in human U87MG cells assessed as reduction in 2-HG levels after 24 hrs by rapidfire hi...
TargetIsocitrate dehydrogenase [NADP] cytoplasmic(Homo sapiens (Human))
Forma Therapeutics
Curated by ChEMBL
LigandPNGBDBM50506474(Ft-2102 | Olutasidenib | US11311527, Cpd ID 1 | US...)
Affinity DataIC50:  6nM. Assay description: Inhibition of human Myc-DDK-tagged IDH1 R132G mutant expressed in human U87MG cells assessed as reduction in 2-HG levels after 24 hrs by rapidfire hi...
TargetIsocitrate dehydrogenase [NADP], mitochondrial(Homo sapiens (Human))
Forma Therapeutics
Curated by ChEMBL
LigandPNGBDBM50506474(Ft-2102 | Olutasidenib | US11311527, Cpd ID 1 | US...)
Affinity DataIC50:  2.73E+4nM. Assay description: Inhibition of IDH2 R172K mutant (unknown origin)
In DepthDetails ArticlePubMed
TargetIsocitrate dehydrogenase [NADP], mitochondrial(Homo sapiens (Human))
Forma Therapeutics
Curated by ChEMBL
LigandPNGBDBM50506474(Ft-2102 | Olutasidenib | US11311527, Cpd ID 1 | US...)
Affinity DataIC50: >1.00E+5nM. Assay description: Inhibition of IDH2 R140Q mutant (unknown origin)
In DepthDetails ArticlePubMed
TargetIsocitrate dehydrogenase [NADP] cytoplasmic(Homo sapiens (Human))
Forma Therapeutics
Curated by ChEMBL
LigandPNGBDBM50506474(Ft-2102 | Olutasidenib | US11311527, Cpd ID 1 | US...)
Affinity DataIC50:  42nM. Assay description: Inhibition of human Myc-DDK-tagged IDH1 R132L mutant expressed in human U87MG cells assessed as reduction in 2-HG levels after 24 hrs by rapidfire hi...
TargetIsocitrate dehydrogenase [NADP] cytoplasmic(Homo sapiens (Human))
Forma Therapeutics
Curated by ChEMBL
LigandPNGBDBM50506474(Ft-2102 | Olutasidenib | US11311527, Cpd ID 1 | US...)
Affinity DataIC50:  2.24E+4nM. Assay description: Inhibition of wild-type IDH1 (unknown origin)
TargetIsocitrate dehydrogenase [NADP] cytoplasmic(Homo sapiens (Human))
Forma Therapeutics
Curated by ChEMBL
LigandPNGBDBM50506474(Ft-2102 | Olutasidenib | US11311527, Cpd ID 1 | US...)
Affinity DataIC50:  21nM. Assay description: Inhibition of recombinant human Myc-DDK-tagged IDH1 R132H mutant using alpha-ketoglutarate as substrate preincubated for 15 mins followed by substrat...
TargetIsocitrate dehydrogenase [NADP] cytoplasmic(Homo sapiens (Human))
Forma Therapeutics
Curated by ChEMBL
LigandPNGBDBM50506474(Ft-2102 | Olutasidenib | US11311527, Cpd ID 1 | US...)
Affinity DataIC50:  9nM. Assay description: Inhibition of human Myc-DDK-tagged IDH1 R132S mutant expressed in human U87MG cells assessed as reduction in 2-HG levels after 24 hrs by rapidfire hi...
TargetIsocitrate dehydrogenase [NADP] cytoplasmic(Homo sapiens (Human))
Forma Therapeutics
Curated by ChEMBL
LigandPNGBDBM50506474(Ft-2102 | Olutasidenib | US11311527, Cpd ID 1 | US...)
Affinity DataIC50:  94nM. Assay description: Inhibition of IDH1 R132C mutant in human HCT116 cells assessed as reduction in 2-HG levels after 24 hrs by RapidFire high-throughput mass spectrometr...
TargetIsocitrate dehydrogenase [NADP] cytoplasmic [R132H](Homo sapiens (Human))
Forma Therapeutics
US Patent
LigandPNGBDBM50506474(Ft-2102 | Olutasidenib | US11311527, Cpd ID 1 | US...)
Affinity DataIC50:  21.2nM. Assay description: Please see paper.
TargetIsocitrate dehydrogenase [NADP] cytoplasmic [R132C](Homo sapiens (Human))
Forma Therapeutics
US Patent
LigandPNGBDBM50506474(Ft-2102 | Olutasidenib | US11311527, Cpd ID 1 | US...)
Affinity DataIC50:  5.22E+3nM. Assay description: Please see paper.
TargetIsocitrate dehydrogenase [NADP] cytoplasmic [R132H](Homo sapiens (Human))
Forma Therapeutics
US Patent
LigandPNGBDBM50506474(Ft-2102 | Olutasidenib | US11311527, Cpd ID 1 | US...)
Affinity DataIC50:  21.2nM. Assay description: The cellular potency of Compound 1 in suppressing intracellular 2-HG levels was determined in cell lines expressing five different mutated IDH-1 prot...
TargetIsocitrate dehydrogenase [NADP] cytoplasmic [R132C](Homo sapiens (Human))
Forma Therapeutics
US Patent
LigandPNGBDBM50506474(Ft-2102 | Olutasidenib | US11311527, Cpd ID 1 | US...)
Affinity DataIC50:  5.22E+3nM. Assay description: The cellular potency of Compound 1 in suppressing intracellular 2-HG levels was determined in cell lines expressing five different mutated IDH-1 prot...
TargetIsocitrate dehydrogenase [NADP] cytoplasmic [R132H](Homo sapiens (Human))
Forma Therapeutics
US Patent
LigandPNGBDBM50506474(Ft-2102 | Olutasidenib | US11311527, Cpd ID 1 | US...)
Affinity DataIC50:  14.3nM. Assay description: Assays were performed in a 384-well black plate. An aliquot of 250 nL of compound was incubated with 10 μL of 30 nM IDH1-R132H or 10 nM IDH1-R13...
TargetIsocitrate dehydrogenase [NADP] cytoplasmic [R132C](Homo sapiens (Human))
Forma Therapeutics
US Patent
LigandPNGBDBM50506474(Ft-2102 | Olutasidenib | US11311527, Cpd ID 1 | US...)
Affinity DataIC50:  77nM. Assay description: Assays were performed in a 384-well black plate. An aliquot of 250 nL of compound was incubated with 10 μL of 30 nM IDH1-R132H or 10 nM IDH1-R13...
TargetIsocitrate dehydrogenase [NADP] cytoplasmic [R132H](Homo sapiens (Human))
Forma Therapeutics
US Patent
LigandPNGBDBM50506474(Ft-2102 | Olutasidenib | US11311527, Cpd ID 1 | US...)
Affinity DataIC50:  12.9nM. Assay description: Assays were performed in a 384-well black plate. An aliquot of 250 nL of compound was incubated with 10 μL of 30 nM IDH1-R132H or 10 nM IDH1-R13...
TargetIsocitrate dehydrogenase [NADP] cytoplasmic [R132C](Homo sapiens (Human))
Forma Therapeutics
US Patent
LigandPNGBDBM50506474(Ft-2102 | Olutasidenib | US11311527, Cpd ID 1 | US...)
Affinity DataIC50:  67.1nM. Assay description: Assays were performed in a 384-well black plate. An aliquot of 250 nL of compound was incubated with 10 μL of 30 nM IDH1-R132H or 10 nM IDH1-R13...
TargetIsocitrate dehydrogenase [NADP] cytoplasmic [R132H](Homo sapiens (Human))
Forma Therapeutics
US Patent
LigandPNGBDBM50506474(Ft-2102 | Olutasidenib | US11311527, Cpd ID 1 | US...)
Affinity DataIC50:  1nM. Assay description: Compound 1 was not initially reported as having the greatest biochemical potency compared to reports for certain other small molecule inhibitors of m...
TargetIsocitrate dehydrogenase [NADP] cytoplasmic [R132C](Homo sapiens (Human))
Forma Therapeutics
US Patent
LigandPNGBDBM50506474(Ft-2102 | Olutasidenib | US11311527, Cpd ID 1 | US...)
Affinity DataIC50:  5.10nM. Assay description: Compound 1 was not initially reported as having the greatest biochemical potency compared to reports for certain other small molecule inhibitors of m...
TargetIsocitrate dehydrogenase [NADP] cytoplasmic(Homo sapiens (Human))
Forma Therapeutics
Curated by ChEMBL
LigandPNGBDBM50506474(Ft-2102 | Olutasidenib | US11311527, Cpd ID 1 | US...)
Affinity DataIC50:  922nM. Assay description: Compound 1 was not initially reported as having the greatest biochemical potency compared to reports for certain other small molecule inhibitors of m...
TargetIsocitrate dehydrogenase [NADP], mitochondrial [R172K](Homo sapiens (Human))
Forma Therapeutics
US Patent
LigandPNGBDBM50506474(Ft-2102 | Olutasidenib | US11311527, Cpd ID 1 | US...)
Affinity DataIC50: >1.00E+3nM. Assay description: Compound 1 was not initially reported as having the greatest biochemical potency compared to reports for certain other small molecule inhibitors of m...
In DepthDetails US Patent
TargetIsocitrate dehydrogenase [NADP], mitochondrial [R140Q](Homo sapiens (Human))
Forma Therapeutics
US Patent
LigandPNGBDBM50506474(Ft-2102 | Olutasidenib | US11311527, Cpd ID 1 | US...)
Affinity DataIC50: >4.00E+3nM. Assay description: Compound 1 was not initially reported as having the greatest biochemical potency compared to reports for certain other small molecule inhibitors of m...
In DepthDetails US Patent
TargetIsocitrate dehydrogenase [NADP] cytoplasmic [R132H](Homo sapiens (Human))
Forma Therapeutics
US Patent
LigandPNGBDBM50506474(Ft-2102 | Olutasidenib | US11311527, Cpd ID 1 | US...)
Affinity DataIC50: <10nM. Assay description: Compound 1 was not initially reported as having the greatest biochemical potency compared to reports for certain other small molecule inhibitors of m...
TargetIsocitrate dehydrogenase [NADP] cytoplasmic [R132C](Homo sapiens (Human))
Forma Therapeutics
US Patent
LigandPNGBDBM50506474(Ft-2102 | Olutasidenib | US11311527, Cpd ID 1 | US...)
Affinity DataIC50: <50nM. Assay description: Compound 1 was not initially reported as having the greatest biochemical potency compared to reports for certain other small molecule inhibitors of m...
TargetIsocitrate dehydrogenase [NADP] cytoplasmic [R132G](Homo sapiens (Human))
Forma Therapeutics
US Patent
LigandPNGBDBM50506474(Ft-2102 | Olutasidenib | US11311527, Cpd ID 1 | US...)
Affinity DataIC50: <50nM. Assay description: Compound 1 was not initially reported as having the greatest biochemical potency compared to reports for certain other small molecule inhibitors of m...
TargetIsocitrate dehydrogenase [NADP] cytoplasmic [R132L](Homo sapiens (Human))
Forma Therapeutics
US Patent
LigandPNGBDBM50506474(Ft-2102 | Olutasidenib | US11311527, Cpd ID 1 | US...)
Affinity DataIC50: <10nM. Assay description: Compound 1 was not initially reported as having the greatest biochemical potency compared to reports for certain other small molecule inhibitors of m...
In DepthDetails US Patent
TargetIsocitrate dehydrogenase [NADP] cytoplasmic [R132S](Homo sapiens (Human))
Forma Therapeutics
US Patent
LigandPNGBDBM50506474(Ft-2102 | Olutasidenib | US11311527, Cpd ID 1 | US...)
Affinity DataIC50: <10nM. Assay description: Compound 1 was not initially reported as having the greatest biochemical potency compared to reports for certain other small molecule inhibitors of m...
In DepthDetails US Patent
TargetIsocitrate dehydrogenase [NADP] cytoplasmic [R132H](Homo sapiens (Human))
Forma Therapeutics
US Patent
LigandPNGBDBM50506474(Ft-2102 | Olutasidenib | US11311527, Cpd ID 1 | US...)
Affinity DataIC50:  21.2nM. Assay description: Compound 1 was not initially reported as having the greatest biochemical potency compared to reports for certain other small molecule inhibitors of m...
TargetIsocitrate dehydrogenase [NADP] cytoplasmic(Homo sapiens (Human))
Forma Therapeutics
Curated by ChEMBL
LigandPNGBDBM50506474(Ft-2102 | Olutasidenib | US11311527, Cpd ID 1 | US...)
Affinity DataIC50:  114nM. Assay description: Inhibition of recombinant human Myc-DDK-tagged IDH1 R132C mutant using alpha-ketoglutarate as substrate preincubated for 15 mins followed by substrat...