BDBM50510697 CHEMBL4468251
SMILES CCC(CC)O[C@@H]1C=C(C[C@@H]([C@H]1NC(C)=O)n1cc(CO)nn1)C(O)=O
InChI Key InChIKey=IPVDZUUVRPUAMB-ARFHVFGLSA-N
Data  1 KI
PDB links: 1 PDB ID matches this monomer.
  Tab Delimited (TSV)   2D SDfile   Computed 3D by Vconf -m prep SDfile
Find this compound or compounds like it in BindingDB:
Activity Spreadsheet -- Enzyme Inhibition Constant Data from BindingDB
Found 1 hit for monomerid = 50510697
TargetNeuraminidase(Influenza A virus (A/Puerto Rico/8/34/Mount Sinai(...)
Charles University
Curated by ChEMBL
LigandPNGBDBM50510697(CHEMBL4468251)
Affinity DataKi:  5.30E+3nM. Assay description: Inhibition of influenza A virus chicken/Nakorn-Patom/Thailand/CU-K2-2004 Neuraminidase N1 at pH 7.4 by DIANA assay
Ligand InfoPC cidPC sidPDB