BDBM50511109 Cilofexor::GS 9674::Gs-9674::PX-104::PX104
SMILES OC(=O)c1ccnc(c1)N1CC(O)(C1)c1ccc(OCc2c(onc2-c2c(Cl)cccc2Cl)C2CC2)cc1Cl
InChI Key InChIKey=KZSKGLFYQAYZCO-UHFFFAOYSA-N
Data  2 EC50
PDB links: 1 PDB ID matches this monomer.
  Tab Delimited (TSV)   2D SDfile   Computed 3D by Vconf -m prep SDfile
Find this compound or compounds like it in BindingDB:
Activity Spreadsheet -- Enzyme Inhibition Constant Data from BindingDB
Found 2 hits for monomerid = 50511109
TargetBile acid receptor(Homo sapiens (Human))
Terns Pharmaceuticals
Curated by ChEMBL
LigandPNGBDBM50511109(Cilofexor | GS 9674 | Gs-9674 | PX-104 | PX104)
Affinity DataEC50:  15nM. Assay description: Agonist activity at FXR (unknown origin)
TargetBile acid receptor(Homo sapiens (Human))
Terns Pharmaceuticals
Curated by ChEMBL
LigandPNGBDBM50511109(Cilofexor | GS 9674 | Gs-9674 | PX-104 | PX104)
Affinity DataEC50:  41nM. Assay description: Agonist activity at FXR (unknown origin) by cell based assay