BDBM50511940 CHEMBL4443090
SMILES CCCn1c(=O)[nH]c2nc([nH]c2c1=O)-c1ccc(cc1)S(=O)(=O)N1CCN(CC1)c1ccccc1C
InChI Key InChIKey=XUTGEORVTLRZAL-UHFFFAOYSA-N
Data  4 KI
  Tab Delimited (TSV)   2D SDfile   Computed 3D by Vconf -m prep SDfile
Find this compound or compounds like it in BindingDB:
Activity Spreadsheet -- Enzyme Inhibition Constant Data from BindingDB
Found 4 hits for monomerid = 50511940
TargetAdenosine receptor A2b(Homo sapiens (Human))
Rheinische Friedrich-Wilhelms-Universitat Bonn
Curated by ChEMBL
LigandPNGBDBM50511940(CHEMBL4443090)
Affinity DataKi:  0.432nM. Assay description: Displacement of [3H]PSB-603 from recombinant human A2B adenosine receptor expressed in CHO cell membranes measured after 75 mins in presence of adeno...
Ligand InfoPC cidPC sid
In DepthDetails ArticlePubMed
TargetAdenosine receptor A2a(Homo sapiens (Human))
Rheinische Friedrich-Wilhelms-Universitat Bonn
Curated by ChEMBL
LigandPNGBDBM50511940(CHEMBL4443090)
Affinity DataKi:  140nM. Assay description: Displacement of [3H]MSX-2 from recombinant human A2A adenosine receptor expressed in CHO cell membranes measured after 30 mins in presence of adenosi...
Ligand InfoPC cidPC sid
In DepthDetails ArticlePubMed
TargetAdenosine receptor A1(Homo sapiens (Human))
Rheinische Friedrich-Wilhelms-Universitat Bonn
Curated by ChEMBL
LigandPNGBDBM50511940(CHEMBL4443090)
Affinity DataKi:  419nM. Assay description: Displacement of [3H]CCPA from recombinant human A1 adenosine receptor expressed in CHO cell membranes measured after 90 mins in presence of adenosine...
Ligand InfoPC cidPC sid
In DepthDetails ArticlePubMed
TargetAdenosine receptor A3(Homo sapiens (Human))
Rheinische Friedrich-Wilhelms-Universitat Bonn
Curated by ChEMBL
LigandPNGBDBM50511940(CHEMBL4443090)
Affinity DataKi: >1.00E+3nM. Assay description: Displacement of [3H]PSB-11 from recombinant human A3 adenosine receptor expressed in CHO cell membranes measured after 45 mins in presence of adenosi...
Ligand InfoPC cidPC sid
In DepthDetails ArticlePubMed