BDBM50513292 CHEMBL4541654
SMILES NS(=O)(=O)c1ccc(NC(=O)CN2C(=O)NC3(CCCCC3)C2=O)cc1
InChI Key InChIKey=KZSVRJBEJFDDMB-UHFFFAOYSA-N
Data  11 KI
PDB links: 1 PDB ID matches this monomer.
  Tab Delimited (TSV)   2D SDfile   Computed 3D by Vconf -m prep SDfile
Find this compound or compounds like it in BindingDB:
Activity Spreadsheet -- Enzyme Inhibition Constant Data from BindingDB
Found 11 hits for monomerid = 50513292
TargetCarbonic anhydrase 7(Homo sapiens (Human))
University Of Florence
Curated by ChEMBL
LigandPNGBDBM50513292(CHEMBL4541654)
Affinity DataKi:  1.30nM. Assay description: Inhibition of human carbonic anhydrase 7 incubated for 15 mins prior to testing by stopped-flow CO2 hydration assay
Ligand InfoPC cidPC sidPDB
In DepthDetails ArticlePubMed
TargetCarbonic anhydrase 2(Homo sapiens (Human))
University Of Florence
Curated by ChEMBL
LigandPNGBDBM50513292(CHEMBL4541654)
Affinity DataKi:  3.10nM. Assay description: Inhibition of human carbonic anhydrase 2 incubated for 15 mins prior to testing by stopped-flow CO2 hydration assay
Ligand InfoPC cidPC sidPDB
TargetCarbonic anhydrase 9(Homo sapiens (Human))
University Of Florence
Curated by ChEMBL
LigandPNGBDBM50513292(CHEMBL4541654)
Affinity DataKi:  3.30nM. Assay description: Inhibition of human carbonic anhydrase 9 incubated for 15 mins prior to testing by stopped-flow CO2 hydration assay
Ligand InfoPC cidPC sidPDB
In DepthDetails ArticlePubMed
TargetCarbonic anhydrase 1(Homo sapiens (Human))
University Of Florence
Curated by ChEMBL
LigandPNGBDBM50513292(CHEMBL4541654)
Affinity DataKi:  7.5nM. Assay description: Inhibition of human carbonic anhydrase 1 incubated for 15 mins prior to testing by stopped-flow CO2 hydration assay
Ligand InfoPC cidPC sidPDB
In DepthDetails ArticlePubMed
TargetCarbonic anhydrase 12(Homo sapiens (Human))
University Of Florence
Curated by ChEMBL
LigandPNGBDBM50513292(CHEMBL4541654)
Affinity DataKi:  47nM. Assay description: Inhibition of human carbonic anhydrase 12 incubated for 15 mins prior to testing by stopped-flow CO2 hydration assay
Ligand InfoPC cidPC sidPDB
In DepthDetails ArticlePubMed
TargetCarbonic anhydrase 4(Homo sapiens (Human))
University Of Florence
Curated by ChEMBL
LigandPNGBDBM50513292(CHEMBL4541654)
Affinity DataKi:  449nM. Assay description: Inhibition of human carbonic anhydrase 4 incubated for 15 mins prior to testing by stopped-flow CO2 hydration assay
Ligand InfoPC cidPC sidPDB
In DepthDetails ArticlePubMed
TargetCarbonic anhydrase 5A, mitochondrial(Homo sapiens (Human))
University Of Florence
Curated by ChEMBL
LigandPNGBDBM50513292(CHEMBL4541654)
Affinity DataKi:  727nM. Assay description: Inhibition of human carbonic anhydrase 5A incubated for 15 mins prior to testing by stopped-flow CO2 hydration assay
Ligand InfoPC cidPC sidPDB
In DepthDetails ArticlePubMed
TargetCarbonic anhydrase 13(Homo sapiens (Human))
University Of Florence
Curated by ChEMBL
LigandPNGBDBM50513292(CHEMBL4541654)
Affinity DataKi:  809nM. Assay description: Inhibition of human carbonic anhydrase 13 incubated for 15 mins prior to testing by stopped-flow CO2 hydration assay
Ligand InfoPC cidPC sidPDB
In DepthDetails ArticlePubMed
TargetCarbonic anhydrase 5B, mitochondrial(Homo sapiens (Human))
University Of Florence
Curated by ChEMBL
LigandPNGBDBM50513292(CHEMBL4541654)
Affinity DataKi:  4.29E+3nM. Assay description: Inhibition of human carbonic anhydrase 5B incubated for 15 mins prior to testing by stopped-flow CO2 hydration assay
Ligand InfoPC cidPC sidPDB
In DepthDetails ArticlePubMed
TargetCarbonic anhydrase 3(Homo sapiens (Human))
University Of Florence
Curated by ChEMBL
LigandPNGBDBM50513292(CHEMBL4541654)
Affinity DataKi: >1.00E+4nM. Assay description: Inhibition of human carbonic anhydrase 3 incubated for 15 mins prior to testing by stopped-flow CO2 hydration assay
Ligand InfoPC cidPC sidPDB
In DepthDetails ArticlePubMed
TargetCarbonic anhydrase 6(Homo sapiens (Human))
University Of Florence
Curated by ChEMBL
LigandPNGBDBM50513292(CHEMBL4541654)
Affinity DataKi: >1.00E+4nM. Assay description: Inhibition of human carbonic anhydrase 6 incubated for 15 mins prior to testing by stopped-flow CO2 hydration assay
Ligand InfoPC cidPC sidPDB
In DepthDetails ArticlePubMed