BDBM50515470 CHEMBL4555120
SMILES COc1ccc(CCOCCCCCNc2c3CCCCc3nc3ccccc23)cc1OC
InChI Key InChIKey=HEPJUELRSNLABC-UHFFFAOYSA-N
Data  4 KI  2 IC50
  Tab Delimited (TSV)   2D SDfile   Computed 3D by Vconf -m prep SDfile
Find this compound or compounds like it in BindingDB:
Activity Spreadsheet -- Enzyme Inhibition Constant Data from BindingDB
Found 6 hits for monomerid = 50515470
TargetCholinesterase(Equus caballus (Horse))
Universidad De Sevilla
Curated by ChEMBL
LigandPNGBDBM50515470(CHEMBL4555120)
Affinity DataKi:  1.90nM. Assay description: Inhibition of equine serum BuChE assessed as dissociation constant for enzyme-substrate-inhibitor complex using butyrylthiocholine iodide as substrat...
Ligand InfoPC cidPC sid
In DepthDetails ArticlePubMed
TargetCholinesterase(Equus caballus (Horse))
Universidad De Sevilla
Curated by ChEMBL
LigandPNGBDBM50515470(CHEMBL4555120)
Affinity DataKi:  7nM. Assay description: Inhibition of equine serum BuChE assessed as dissociation constant for enzyme-inhibitor complex using butyrylthiocholine iodide as substrate measured...
Ligand InfoPC cidPC sid
In DepthDetails ArticlePubMed
TargetAcetylcholinesterase(Electrophorus electricus (Electric eel))
Universidad De Sevilla
Curated by ChEMBL
LigandPNGBDBM50515470(CHEMBL4555120)
Affinity DataKi:  55nM. Assay description: Inhibition of electric eel AChE assessed as dissociation constant for enzyme-substrate-inhibitor complex using acetylthiocholine iodide as substrate ...
Ligand InfoPC cidPC sid
In DepthDetails ArticlePubMed
TargetAcetylcholinesterase(Electrophorus electricus (Electric eel))
Universidad De Sevilla
Curated by ChEMBL
LigandPNGBDBM50515470(CHEMBL4555120)
Affinity DataKi:  170nM. Assay description: Inhibition of electric eel AChE assessed as dissociation constant for enzyme-inhibitor complex using acetylthiocholine iodide as substrate measured f...
Ligand InfoPC cidPC sid
In DepthDetails ArticlePubMed
TargetCholinesterase(Homo sapiens (Human))
Universidad De Sevilla
Curated by ChEMBL
LigandPNGBDBM50515470(CHEMBL4555120)
Affinity DataIC50:  0.515nM. Assay description: Inhibition of human serum BuChe by Ellman's method
Ligand InfoPC cidPC sid
In DepthDetails ArticlePubMed
TargetAcetylcholinesterase(Homo sapiens (Human))
Universidad De Sevilla
Curated by ChEMBL
LigandPNGBDBM50515470(CHEMBL4555120)
Affinity DataIC50:  168nM. Assay description: Inhibition of human recombinant AChE expressed in HEK293 cells using acetylcholine iodide as substrate preincubated with enzyme for 20 mins followed ...
Ligand InfoPC cidPC sid
In DepthDetails ArticlePubMed