BDBM50526996 CHEMBL4284234
SMILES CCCCCCCSCC(=O)N[C@H]1CCOC1=O
InChI Key InChIKey=MIKPZQJWUCHMLM-NSHDSACASA-N
Data  1 IC50
  Tab Delimited (TSV)   2D SDfile   Computed 3D by Vconf -m prep SDfile
Find this compound or compounds like it in BindingDB:
Activity Spreadsheet -- Enzyme Inhibition Constant Data from BindingDB
Found 1 hit for monomerid = 50526996
TargetTranscriptional activator protein LasR(Pseudomonas aeruginosa)
Larkin University
Curated by ChEMBL
LigandPNGBDBM50526996(CHEMBL4284234)
Affinity DataIC50:  6.00E+3nM. Assay description: Antagonist activity at Pseudomonas aeruginosa LasR transfected with lasB-GFP by luminescence method
Ligand InfoKEGGPC cidPC sid
In DepthDetails ArticlePubMed