BDBM50529218 CHEMBL4473641
SMILES O=C1c2ccccc2C(Cc2ccnnc2)(Cc2ccnnc2)c2ccccc12
InChI Key InChIKey=REYRVLDSUZWNSN-UHFFFAOYSA-N
Data  1 IC50
  Tab Delimited (TSV)   2D SDfile   Computed 3D by Vconf -m prep SDfile
Find this compound or compounds like it in BindingDB:
Activity Spreadsheet -- Enzyme Inhibition Constant Data from BindingDB
Found 1 hit for monomerid = 50529218
TargetPotassium voltage-gated channel subfamily KQT member 2(Homo sapiens (Human))
Marquette University
Curated by ChEMBL
LigandPNGBDBM50529218(CHEMBL4473641)
Affinity DataIC50:  1.00E+4nM. Assay description: Inhibition of Kv7.2 in human HEK293 cells incubated for 1 hr by thallium flux assay
Ligand InfoPC cidPC sid
In DepthDetails ArticlePubMed