BDBM50529873 CHEMBL4552616
SMILES Cc1ncccc1Oc1sc(C(N)=O)c2CCc3cnn(C)c3-c12
InChI Key InChIKey=IUIDISNVIBKQQL-UHFFFAOYSA-N
Data  4 IC50
  Tab Delimited (TSV)   2D SDfile   Computed 3D by Vconf -m prep SDfile
Find this compound or compounds like it in BindingDB:
Activity Spreadsheet -- Enzyme Inhibition Constant Data from BindingDB
Found 4 hits for monomerid = 50529873
TargetCyclin-C(Homo sapiens (Human))
Shaoxing University
Curated by ChEMBL
LigandPNGBDBM50529873(CHEMBL4552616)
Affinity DataIC50:  1.60nM. Assay description: Displacement of Kinase tracer 236 from recombinant full-length human N-terminal GST-fused CDK8 (1 to 464 residues)/cyclin C (1 to 283 residues) expre...
Ligand InfoPC cidPC sid
In DepthDetails ArticlePubMed
TargetCyclin-C/Cyclin-dependent kinase 19(Homo sapiens (Human))
Shaoxing University
Curated by ChEMBL
LigandPNGBDBM50529873(CHEMBL4552616)
Affinity DataIC50:  1.90nM. Assay description: Displacement of Kinase tracer 236 from GST-fused CDK19/cyclin C (unknown origin) after 60 mins by TR-FRET assay
Ligand InfoPC cidPC sid
In DepthDetails ArticlePubMed
TargetCyclin-C(Homo sapiens (Human))
Shaoxing University
Curated by ChEMBL
LigandPNGBDBM50529873(CHEMBL4552616)
Affinity DataIC50:  1.60nM. Assay description: Displacement of Kinase tracer 236 from recombinant full-length human N-terminal GST-fused CDK8 (1 to 464 residues)/cyclin C (1 to 283 residues) expre...
Ligand InfoPC cidPC sid
In DepthDetails ArticlePubMed
TargetCyclin-C/Cyclin-dependent kinase 19(Homo sapiens (Human))
Shaoxing University
Curated by ChEMBL
LigandPNGBDBM50529873(CHEMBL4552616)
Affinity DataIC50:  1.90nM. Assay description: Displacement of Kinase tracer 236 from GST-fused CDK19/cyclin C (unknown origin) after 60 mins by TR-FRET assay
Ligand InfoPC cidPC sid
In DepthDetails ArticlePubMed