BDBM50529980 CHEMBL4535926
SMILES [#6]-c1cccc(n1)C#C\[#6]=[#6]-1/[#6]-[#6]-[#7](-[#6]-[#6]-1)-[#6](=O)-c1cccc(Cl)c1
InChI Key InChIKey=PGBLXONVLMXXEL-UHFFFAOYSA-N
Data  4 KI  8 IC50
  Tab Delimited (TSV)   2D SDfile   Computed 3D by Vconf -m prep SDfile
Find this compound or compounds like it in BindingDB:
Activity Spreadsheet -- Enzyme Inhibition Constant Data from BindingDB
Found 12 hits for monomerid = 50529980
TargetMetabotropic glutamate receptor 5(Homo sapiens (Human))
Recordati
Curated by ChEMBL
LigandPNGBDBM50529980(CHEMBL4535926)
Affinity DataKi:  0.700nM. Assay description: Displacement of [3H]MPEP from human mGlu5 receptor expressed in CHO-TREx cell membranes after 60 mins by liquid scintillation spectrometric analysis
Ligand InfoPC cidPC sid
In DepthDetails ArticlePubMed
TargetMetabotropic glutamate receptor 5(Homo sapiens (Human))
Recordati
Curated by ChEMBL
LigandPNGBDBM50529980(CHEMBL4535926)
Affinity DataKi:  0.700nM. Assay description: Displacement of [3H]MPEP from human mGlu5 receptor expressed in CHO-TREx cell membranes after 60 mins by liquid scintillation spectrometric analysis
Ligand InfoPC cidPC sid
In DepthDetails ArticlePubMed
TargetMetabotropic glutamate receptor 1(RAT)
Recordati
Curated by ChEMBL
LigandPNGBDBM50529980(CHEMBL4535926)
Affinity DataKi: >1.00E+3nM. Assay description: Displacement of [3H]MPEP from rat mGlu1 receptor expressed in CHO-TREx cell membranes after 30 mins by liquid scintillation spectrometric analysis
Ligand InfoPC cidPC sid
In DepthDetails ArticlePubMed
TargetMetabotropic glutamate receptor 1(RAT)
Recordati
Curated by ChEMBL
LigandPNGBDBM50529980(CHEMBL4535926)
Affinity DataKi: >1.00E+3nM. Assay description: Displacement of [3H]MPEP from rat mGlu1 receptor expressed in CHO-TREx cell membranes after 30 mins by liquid scintillation spectrometric analysis
Ligand InfoPC cidPC sid
In DepthDetails ArticlePubMed
TargetCytochrome P450 3A4(Homo sapiens (Human))
Recordati
Curated by ChEMBL
LigandPNGBDBM50529980(CHEMBL4535926)
Affinity DataIC50: >2.00E+4nM. Assay description: Inhibition of recombinant human CYP3A4 using 7-benzyloxy-trifluoromethylcoumarin as substrate preincubated for 10 mins followed by substrate addition...
Ligand InfoPC cidPC sid
In DepthDetails ArticlePubMed
TargetCytochrome P450 3A4(Homo sapiens (Human))
Recordati
Curated by ChEMBL
LigandPNGBDBM50529980(CHEMBL4535926)
Affinity DataIC50: >2.00E+4nM. Assay description: Inhibition of recombinant human CYP3A4 using 7-benzyloxy-trifluoromethylcoumarin as substrate preincubated for 10 mins followed by substrate addition...
Ligand InfoPC cidPC sid
In DepthDetails ArticlePubMed
TargetCytochrome P450 2D6(Homo sapiens (Human))
Recordati
Curated by ChEMBL
LigandPNGBDBM50529980(CHEMBL4535926)
Affinity DataIC50: >2.00E+4nM. Assay description: Inhibition of recombinant human CYP2D6 using 3-[2-(N,N-diethylamino)ethyl]-7-methoxy-4-methylcoumarin as substrate preincubated for 10 mins followed ...
Ligand InfoPC cidPC sid
In DepthDetails ArticlePubMed
TargetMetabotropic glutamate receptor 5(Homo sapiens (Human))
Recordati
Curated by ChEMBL
LigandPNGBDBM50529980(CHEMBL4535926)
Affinity DataIC50:  49nM. Assay description: Negative allosteric modulation of human mGlu5 receptor expressed in CHO-TREx cell membranes assessed as reduction in quisqualate-induced Ca2+ mobiliz...
Ligand InfoPC cidPC sid
In DepthDetails ArticlePubMed
TargetCytochrome P450 1A2(Homo sapiens (Human))
Recordati
Curated by ChEMBL
LigandPNGBDBM50529980(CHEMBL4535926)
Affinity DataIC50: >2.00E+4nM. Assay description: Inhibition of recombinant human CYP1A2 using 3-cyano-7-ethoxycoumarin as substrate preincubated for 10 mins followed by substrate addition and measur...
Ligand InfoPC cidPC sid
In DepthDetails ArticlePubMed
TargetCytochrome P450 2D6(Homo sapiens (Human))
Recordati
Curated by ChEMBL
LigandPNGBDBM50529980(CHEMBL4535926)
Affinity DataIC50: >2.00E+4nM. Assay description: Inhibition of recombinant human CYP2D6 using 3-[2-(N,N-diethylamino)ethyl]-7-methoxy-4-methylcoumarin as substrate preincubated for 10 mins followed ...
Ligand InfoPC cidPC sid
In DepthDetails ArticlePubMed
TargetCytochrome P450 1A2(Homo sapiens (Human))
Recordati
Curated by ChEMBL
LigandPNGBDBM50529980(CHEMBL4535926)
Affinity DataIC50: >2.00E+4nM. Assay description: Inhibition of recombinant human CYP1A2 using 3-cyano-7-ethoxycoumarin as substrate preincubated for 10 mins followed by substrate addition and measur...
Ligand InfoPC cidPC sid
In DepthDetails ArticlePubMed
TargetMetabotropic glutamate receptor 5(Homo sapiens (Human))
Recordati
Curated by ChEMBL
LigandPNGBDBM50529980(CHEMBL4535926)
Affinity DataIC50:  49nM. Assay description: Negative allosteric modulation of human mGlu5 receptor expressed in CHO-TREx cell membranes assessed as reduction in quisqualate-induced Ca2+ mobiliz...
Ligand InfoPC cidPC sid
In DepthDetails ArticlePubMed