BDBM50530438 Mosapramine::Mosapramine hydrochloride
SMILES Clc1ccc2CCc3ccccc3N(CCCN3CCC4(CC3)N3CCCCC3NC4=O)c2c1
InChI Key InChIKey=PXUIZULXJVRBPC-UHFFFAOYSA-N
Data  2 KI
  Tab Delimited (TSV)   2D SDfile   Computed 3D by Vconf -m prep SDfile
Find this compound or compounds like it in BindingDB:
Activity Spreadsheet -- Enzyme Inhibition Constant Data from BindingDB
Found 2 hits for monomerid = 50530438
TargetD(4) dopamine receptor(Homo sapiens (Human))
Palack£
Curated by ChEMBL
LigandPNGBDBM50530438(Mosapramine | Mosapramine hydrochloride)
Affinity DataKi:  0.0300nM. Assay description: Agonist activity at dopamine D4 receptor (unknown origin)
In DepthDetails ArticlePubMed
TargetD(4) dopamine receptor(Homo sapiens (Human))
Palack£
Curated by ChEMBL
LigandPNGBDBM50530438(Mosapramine | Mosapramine hydrochloride)
Affinity DataKi:  0.0300nM. Assay description: Agonist activity at dopamine D4 receptor (unknown origin)
In DepthDetails ArticlePubMed