BDBM50534291 CHEMBL4559236
SMILES Fc1cccc(c1)-c1cn(nn1)C1CN2CCC1CC2
InChI Key InChIKey=TZWVPYLQJDFQHL-UHFFFAOYSA-N
Data  3 KI
  Tab Delimited (TSV)   2D SDfile   Computed 3D by Vconf -m prep SDfile
Find this compound or compounds like it in BindingDB:
Activity Spreadsheet -- Enzyme Inhibition Constant Data from BindingDB
Found 3 hits for monomerid = 50534291
TargetNeuronal acetylcholine receptor subunit alpha-3/beta-4(Homo sapiens (Human))
Mahidol University
Curated by ChEMBL
LigandPNGBDBM50534291(CHEMBL4559236)
Affinity DataKi:  5.20nM. Assay description: Displacement of [3H]epibatidine from human alpha3beta4 nAChR transfected in HEK293 cell membranes after 120 mins by liquid scintillation counting
Ligand InfoPC cidPC sid
In DepthDetails ArticlePubMed
TargetNeuronal acetylcholine receptor subunit alpha-7(Homo sapiens (Human))
Mahidol University
Curated by ChEMBL
LigandPNGBDBM50534291(CHEMBL4559236)
Affinity DataKi:  133nM. Assay description: Displacement of [3H]MLA from human alpha7 nAChR transfected in human SH-SY5Y cell membranes after 120 mins by liquid scintillation counting
Ligand InfoPC cidPC sid
In DepthDetails ArticlePubMed
TargetNeuronal acetylcholine receptor subunit alpha-4/beta-2(Homo sapiens (Human))
Mahidol University
Curated by ChEMBL
LigandPNGBDBM50534291(CHEMBL4559236)
Affinity DataKi:  748nM. Assay description: Displacement of [3H]epibatidine from human alpha4beta2 nAChR transfected in HEK293 cell membranes after 120 mins by liquid scintillation counting
Ligand InfoPC cidPC sid
In DepthDetails ArticlePubMed