BDBM50535791 CHEMBL4593581
SMILES CCCCCCCC(=O)O[C@H]1\C(C[C@H]2C[C@H](CO)OC(=O)CCOc3ccc(cc3C(=O)OCC(C)(C)[C@]1(O)O2)-c1c(C)noc1C)=C\C(=O)OC
InChI Key InChIKey=DCWRHBIYRNMFQY-BEFWBBRSSA-N
Data  1 KI
  Tab Delimited (TSV)   2D SDfile   Computed 3D by Vconf -m prep SDfile
Find this compound or compounds like it in BindingDB:
Activity Spreadsheet -- Enzyme Inhibition Constant Data from BindingDB
Found 1 hit for monomerid = 50535791
TargetProtein kinase C delta type(Homo sapiens (Human))
Stanford University
Curated by ChEMBL
LigandPNGBDBM50535791(CHEMBL4593581)
Affinity DataKi:  2.80nM. Assay description: Inhibition of [3H]PDBu binding to recombinant full length human PKCdelta expressed in baculovirus expression system incubated for 5 mins by scintilla...
Ligand InfoPC cidPC sid
In DepthDetails ArticlePubMed