BDBM50537721 CHEMBL4646478::US11230547, Compound 1-17
SMILES [H][C@]12CN(c3nc(ncc3C#N)-c3ccnc4[nH]ccc34)[C@]([H])(CN1c1cccc(F)c1)C2
InChI Key
Data  3 IC50
  Tab Delimited (TSV)   2D SDfile   Computed 3D by Vconf -m prep SDfile
Find this compound or compounds like it in BindingDB:
Activity Spreadsheet -- Enzyme Inhibition Constant Data from BindingDB
Found 3 hits for monomerid = 50537721
LigandPNGBDBM50537721(CHEMBL4646478 | US11230547, Compound 1-17)
Affinity DataIC50:  1.00E+4nM. Assay description: Inhibition of the fibroblast growth factor receptor (FGFR1)
Ligand InfoPC cidPC sid
In DepthDetails ArticlePubMed
LigandPNGBDBM50537721(CHEMBL4646478 | US11230547, Compound 1-17)
Affinity DataIC50:  56nM. Assay description: This assay was developed and further optimized from a kit produced by Upstate (Millipore catalog #33-047) (Millipore Sigma, Billerica Mass., USA) and...
Ligand InfoPC cidPC sid
In DepthDetails US Patent
LigandPNGBDBM50537721(CHEMBL4646478 | US11230547, Compound 1-17)
Affinity DataIC50:  56nM. Assay description: Inhibition of recombinant human full-length N-terminal GST-tagged p110delta/untagged full-length p85alpha expressed in baculovirus infected Sf21 cell...
Ligand InfoPC cidPC sid
In DepthDetails ArticlePubMed