BDBM50537725 CHEMBL4635168::US11230547, Compound 2-1
SMILES [H][C@]12CN(c3nc(ncc3C#N)-c3cnn(C)c3)[C@]([H])(CN1C(=O)C1CC1)C2
InChI Key InChIKey=BAPNSRDKEKRQFX-GJZGRUSLSA-N
Data  3 IC50
  Tab Delimited (TSV)   2D SDfile   Computed 3D by Vconf -m prep SDfile
Find this compound or compounds like it in BindingDB:
Activity Spreadsheet -- Enzyme Inhibition Constant Data from BindingDB
Found 3 hits for monomerid = 50537725
LigandPNGBDBM50537725(CHEMBL4635168 | US11230547, Compound 2-1)
Affinity DataIC50:  258nM. Assay description: Inhibition of the fibroblast growth factor receptor (FGFR1)
Ligand InfoPC cidPC sid
In DepthDetails ArticlePubMed
LigandPNGBDBM50537725(CHEMBL4635168 | US11230547, Compound 2-1)
Affinity DataIC50:  160nM. Assay description: This assay was developed and further optimized from a kit produced by Upstate (Millipore catalog #33-047) (Millipore Sigma, Billerica Mass., USA) and...
Ligand InfoPC cidPC sid
In DepthDetails US Patent
LigandPNGBDBM50537725(CHEMBL4635168 | US11230547, Compound 2-1)
Affinity DataIC50:  161nM. Assay description: Inhibition of recombinant human full-length N-terminal GST-tagged p110delta/untagged full-length p85alpha expressed in baculovirus infected Sf21 cell...
Ligand InfoPC cidPC sid
In DepthDetails ArticlePubMed