BDBM50537726 CHEMBL4635364::US11230547, Compound 2-2
SMILES [H][C@]12CN([C@]([H])(CN1c1nc(ncc1C#N)-c1cnn(C)c1)C2)S(=O)(=O)C1CC1
InChI Key InChIKey=AQNIGKMKZXSRSH-KBPBESRZSA-N
Data  3 IC50
  Tab Delimited (TSV)   2D SDfile   Computed 3D by Vconf -m prep SDfile
Find this compound or compounds like it in BindingDB:
Activity Spreadsheet -- Enzyme Inhibition Constant Data from BindingDB
Found 3 hits for monomerid = 50537726
LigandPNGBDBM50537726(CHEMBL4635364 | US11230547, Compound 2-2)
Affinity DataIC50:  4.12E+3nM. Assay description: Inhibition of the fibroblast growth factor receptor (FGFR1)
Ligand InfoPC cidPC sid
In DepthDetails ArticlePubMed
LigandPNGBDBM50537726(CHEMBL4635364 | US11230547, Compound 2-2)
Affinity DataIC50:  1.20E+3nM. Assay description: This assay was developed and further optimized from a kit produced by Upstate (Millipore catalog #33-047) (Millipore Sigma, Billerica Mass., USA) and...
Ligand InfoPC cidPC sid
In DepthDetails US Patent
LigandPNGBDBM50537726(CHEMBL4635364 | US11230547, Compound 2-2)
Affinity DataIC50:  1.19E+3nM. Assay description: Inhibition of recombinant human full-length N-terminal GST-tagged p110delta/untagged full-length p85alpha expressed in baculovirus infected Sf21 cell...
Ligand InfoPC cidPC sid
In DepthDetails ArticlePubMed