BDBM50537729 CHEMBL4644811::US11230547, Compound 3-2
SMILES Cn1cc(cn1)-c1ncc(C#N)c(n1)N1CCN(CC1)c1cccc(F)c1
InChI Key InChIKey=LVYWVOBKHHMZRO-UHFFFAOYSA-N
Data  2 IC50
  Tab Delimited (TSV)   2D SDfile   Computed 3D by Vconf -m prep SDfile
Find this compound or compounds like it in BindingDB:
Activity Spreadsheet -- Enzyme Inhibition Constant Data from BindingDB
Found 2 hits for monomerid = 50537729
TargetPhosphatidylinositol 4,5-bisphosphate 3-kinase catalytic subunit delta isoform(Homo sapiens (Human))
Merck Sharp & Dohme
US Patent
LigandPNGBDBM50537729(CHEMBL4644811 | US11230547, Compound 3-2)
Affinity DataIC50:  1.60E+3nM. Assay description: This assay was developed and further optimized from a kit produced by Upstate (Millipore catalog #33-047) (Millipore Sigma, Billerica Mass., USA) and...
Ligand InfoPC cidPC sid
In DepthDetails US Patent
LigandPNGBDBM50537729(CHEMBL4644811 | US11230547, Compound 3-2)
Affinity DataIC50:  1.60E+3nM. Assay description: Inhibition of recombinant human full-length N-terminal GST-tagged p110delta/untagged full-length p85alpha expressed in baculovirus infected Sf21 cell...
Ligand InfoPC cidPC sid
In DepthDetails ArticlePubMed