BDBM50548354 CHEMBL4753469
SMILES CNC(=O)c1ncn2ccc(Nc3nccc(n3)-n3cc(CN(C)C)cn3)cc12
InChI Key InChIKey=UAYLWDBQVWXUCN-UHFFFAOYSA-N
Data  2 IC50
  Tab Delimited (TSV)   2D SDfile   Computed 3D by Vconf -m prep SDfile
Find this compound or compounds like it in BindingDB:
Activity Spreadsheet -- Enzyme Inhibition Constant Data from BindingDB
Found 2 hits for monomerid = 50548354
TargetPotassium voltage-gated channel subfamily H member 2(Homo sapiens (Human))
Astrazeneca
Curated by ChEMBL
LigandPNGBDBM50548354(CHEMBL4753469)
Affinity DataIC50:  7.30E+3nM. Assay description: Inhibition of human ERG by plate-based planar patch clamp method
Ligand InfoPC cidPC sid
In DepthDetails ArticlePubMed
TargetTyrosine-protein kinase SYK(Homo sapiens (Human))
Astrazeneca
Curated by ChEMBL
LigandPNGBDBM50548354(CHEMBL4753469)
Affinity DataIC50:  0.0900nM. Assay description: Inhibition of recombinant full length SYK (unknown origin) by biochemical Omnia assay
Ligand InfoPC cidPC sid
In DepthDetails ArticlePubMed