BDBM50549891 CHEMBL4790083
SMILES O=C(CCS(=O)(=O)c1cccc2ncsc12)N1CC2CCC(C1)N2c1ccc(cn1)C#N
InChI Key InChIKey=WKWYANDGYZVVAK-UHFFFAOYSA-N
Data  4 KI  12 IC50
  Tab Delimited (TSV)   2D SDfile   Computed 3D by Vconf -m prep SDfile
Find this compound or compounds like it in BindingDB:
Activity Spreadsheet -- Enzyme Inhibition Constant Data from BindingDB
Found 16 hits for monomerid = 50549891
TargetMuscarinic acetylcholine receptor M1(Homo sapiens (Human))
Pipeline Therapeutics
Curated by ChEMBL
LigandPNGBDBM50549891(CHEMBL4790083)
Affinity DataKi:  0.140nM. Assay description: Displacement of [3H]NMS from human recombinant muscarinic receptor M1 expressed in CHO-K1 cell membranes assessed as inhibition constant incubated fo...
Ligand InfoPC cidPC sid
In DepthDetails ArticlePubMed
TargetMuscarinic acetylcholine receptor M3(Homo sapiens (Human))
Pipeline Therapeutics
Curated by ChEMBL
LigandPNGBDBM50549891(CHEMBL4790083)
Affinity DataKi:  0.840nM. Assay description: Displacement of [3H]NMS from human recombinant muscarinic receptor M3 expressed in CHO-K1 cell membranes assessed as inhibition constant incubated fo...
Ligand InfoPC cidPC sid
In DepthDetails ArticlePubMed
TargetMuscarinic acetylcholine receptor M4(Homo sapiens (Human))
Pipeline Therapeutics
Curated by ChEMBL
LigandPNGBDBM50549891(CHEMBL4790083)
Affinity DataKi:  6.5nM. Assay description: Displacement of [3H]NMS from human recombinant muscarinic receptor M4 expressed in CHO-K1 cell membranes assessed as inhibition constant incubated fo...
Ligand InfoPC cidPC sid
In DepthDetails ArticlePubMed
TargetMuscarinic acetylcholine receptor M1(Homo sapiens (Human))
Pipeline Therapeutics
Curated by ChEMBL
LigandPNGBDBM50549891(CHEMBL4790083)
Affinity DataKi:  19nM. Assay description: Displacement of [3H]NMS from human recombinant muscarinic receptor M2 expressed in CHO-K1 cell membranes assessed as inhibition constant incubated fo...
Ligand InfoPC cidPC sid
In DepthDetails ArticlePubMed
TargetMuscarinic acetylcholine receptor M4(Homo sapiens (Human))
Pipeline Therapeutics
Curated by ChEMBL
LigandPNGBDBM50549891(CHEMBL4790083)
Affinity DataIC50:  22nM. Assay description: Antagonist activity at human recombinant muscarinic receptor M4 expressed in CHO-K1 cells assessed as EC80 acetylcholine-induced calcium flux incubat...
Ligand InfoPC cidPC sid
In DepthDetails ArticlePubMed
TargetMuscarinic acetylcholine receptor M3(Homo sapiens (Human))
Pipeline Therapeutics
Curated by ChEMBL
LigandPNGBDBM50549891(CHEMBL4790083)
Affinity DataIC50:  50nM. Assay description: Antagonist activity at human recombinant muscarinic receptor M3 expressed in CHO-K1 cells assessed as EC80 acetylcholine-induced calcium flux incubat...
Ligand InfoPC cidPC sid
In DepthDetails ArticlePubMed
TargetMuscarinic acetylcholine receptor M3(Homo sapiens (Human))
Pipeline Therapeutics
Curated by ChEMBL
LigandPNGBDBM50549891(CHEMBL4790083)
Affinity DataIC50:  55nM. Assay description: Antagonist activity at human recombinant muscarinic receptor M3 expressed in CHO-K1 cells assessed as EC80 acetylcholine-induced calcium flux incubat...
Ligand InfoPC cidPC sid
In DepthDetails ArticlePubMed
TargetMuscarinic acetylcholine receptor M2(Homo sapiens (Human))
Pipeline Therapeutics
Curated by ChEMBL
LigandPNGBDBM50549891(CHEMBL4790083)
Affinity DataIC50:  200nM. Assay description: Antagonist activity at human recombinant muscarinic receptor M2 expressed in CHO-K1 cells assessed as EC80 acetylcholine-induced calcium flux incubat...
Ligand InfoPC cidPC sid
In DepthDetails ArticlePubMed
TargetMuscarinic acetylcholine receptor M2(Homo sapiens (Human))
Pipeline Therapeutics
Curated by ChEMBL
LigandPNGBDBM50549891(CHEMBL4790083)
Affinity DataIC50:  200nM. Assay description: Antagonist activity at human recombinant muscarinic receptor M2 expressed in CHO-K1 cells assessed as EC80 acetylcholine-induced calcium flux incubat...
Ligand InfoPC cidPC sid
In DepthDetails ArticlePubMed
TargetMuscarinic acetylcholine receptor M1(Homo sapiens (Human))
Pipeline Therapeutics
Curated by ChEMBL
LigandPNGBDBM50549891(CHEMBL4790083)
Affinity DataIC50:  1.60nM. Assay description: Antagonist activity at human recombinant muscarinic receptor M1 expressed in CHO-K1 cells assessed as EC80 acetylcholine-induced calcium flux incubat...
Ligand InfoPC cidPC sid
In DepthDetails ArticlePubMed
TargetMuscarinic acetylcholine receptor M1(Homo sapiens (Human))
Pipeline Therapeutics
Curated by ChEMBL
LigandPNGBDBM50549891(CHEMBL4790083)
Affinity DataIC50:  1.58nM. Assay description: Antagonist activity at human recombinant muscarinic receptor M1 expressed in CHO-K1 cells assessed as EC80 acetylcholine-induced calcium flux incubat...
Ligand InfoPC cidPC sid
In DepthDetails ArticlePubMed
TargetMuscarinic acetylcholine receptor M4(Homo sapiens (Human))
Pipeline Therapeutics
Curated by ChEMBL
LigandPNGBDBM50549891(CHEMBL4790083)
Affinity DataIC50:  20nM. Assay description: Antagonist activity at human recombinant muscarinic receptor M4 expressed in CHO-K1 cells assessed as EC80 acetylcholine-induced calcium flux incubat...
Ligand InfoPC cidPC sid
In DepthDetails ArticlePubMed
TargetCytochrome P450 2C9(Homo sapiens (Human))
Pipeline Therapeutics
Curated by ChEMBL
LigandPNGBDBM50549891(CHEMBL4790083)
Affinity DataIC50: >1.00E+4nM. Assay description: Inhibition of human CYP2C9 in pooled human liver microsomes using diclofenac as substrate incubated for 5 mins by LC-MS/MS
Ligand InfoPC cidPC sid
In DepthDetails ArticlePubMed
TargetPotassium voltage-gated channel subfamily H member 2(Homo sapiens (Human))
Pipeline Therapeutics
Curated by ChEMBL
LigandPNGBDBM50549891(CHEMBL4790083)
Affinity DataIC50:  5.60E+3nM. Assay description: Inhibition of human ERG expressed in HEK293 cells by patch clamp assay
Ligand InfoPC cidPC sid
In DepthDetails ArticlePubMed
TargetCytochrome P450 3A4(Homo sapiens (Human))
Pipeline Therapeutics
Curated by ChEMBL
LigandPNGBDBM50549891(CHEMBL4790083)
Affinity DataIC50: >1.00E+4nM. Assay description: Inhibition of human CYP3A4 in pooled human liver microsomes using midazolam as substrate incubated for 5 mins by LC-MS/MS
Ligand InfoPC cidPC sid
In DepthDetails ArticlePubMed
TargetCytochrome P450 2D6(Homo sapiens (Human))
Pipeline Therapeutics
Curated by ChEMBL
LigandPNGBDBM50549891(CHEMBL4790083)
Affinity DataIC50: >1.00E+4nM. Assay description: Inhibition of human CYP2D6 in pooled human liver microsomes using dextromethorphan as substrate incubated for 20 mins by LC-MS/MS
Ligand InfoPC cidPC sid
In DepthDetails ArticlePubMed