BDBM50554257 CHEMBL4742990
SMILES COc1cccc(Cn2cnc3ccc(cc3c2=O)-c2cn[nH]c2)c1
InChI Key InChIKey=QQJKCGXOHWHBQV-UHFFFAOYSA-N
Data  12 IC50
  Tab Delimited (TSV)   2D SDfile   Computed 3D by Vconf -m prep SDfile
Find this compound or compounds like it in BindingDB:
Activity Spreadsheet -- Enzyme Inhibition Constant Data from BindingDB
Found 12 hits for monomerid = 50554257
TargetRAC-alpha serine/threonine-protein kinase(Homo sapiens (Human))
Janssen Research & Development
Curated by ChEMBL
LigandPNGBDBM50554257(CHEMBL4742990)
Affinity DataIC50:  1.45E+3nM. Assay description: Inhibition of human PKBalpha
Ligand InfoPC cidPC sid
In DepthDetails ArticlePubMed
TargetProtein kinase C alpha type(Homo sapiens (Human))
Janssen Research & Development
Curated by ChEMBL
LigandPNGBDBM50554257(CHEMBL4742990)
Affinity DataIC50: >1.00E+4nM. Assay description: Inhibition of human PKCalpha
Ligand InfoPC cidPC sid
In DepthDetails ArticlePubMed
TargetRhodopsin kinase GRK1(Homo sapiens (Human))
Janssen Research & Development
Curated by ChEMBL
LigandPNGBDBM50554257(CHEMBL4742990)
Affinity DataIC50: >1.00E+4nM. Assay description: Inhibition of human GRK1
Ligand InfoPC cidPC sid
In DepthDetails ArticlePubMed
TargetG protein-coupled receptor kinase 5(Homo sapiens (Human))
Janssen Research & Development
Curated by ChEMBL
LigandPNGBDBM50554257(CHEMBL4742990)
Affinity DataIC50:  4.50E+3nM. Assay description: Inhibition of human GRK5
Ligand InfoPC cidPC sid
In DepthDetails ArticlePubMed
TargetG protein-coupled receptor kinase 6(Homo sapiens (Human))
Janssen Research & Development
Curated by ChEMBL
LigandPNGBDBM50554257(CHEMBL4742990)
Affinity DataIC50:  3.27E+3nM. Assay description: Inhibition of human GRK6
Ligand InfoPC cidPC sid
In DepthDetails ArticlePubMed
TargetBeta-adrenergic receptor kinase 1(Homo sapiens (Human))
Janssen Research & Development
Curated by ChEMBL
LigandPNGBDBM50554257(CHEMBL4742990)
Affinity DataIC50:  6nM. Assay description: Inhibition of human GRK2 by LANCE assay
Ligand InfoPC cidPC sid
In DepthDetails ArticlePubMed
TargetProtein kinase C beta type(Homo sapiens (Human))
Janssen Research & Development
Curated by ChEMBL
LigandPNGBDBM50554257(CHEMBL4742990)
Affinity DataIC50:  9.07E+3nM. Assay description: Inhibition of human PKCbeta1
Ligand InfoPC cidPC sid
In DepthDetails ArticlePubMed
TargetCalcium/calmodulin-dependent protein kinase type II subunit beta(Homo sapiens (Human))
Janssen Research & Development
Curated by ChEMBL
LigandPNGBDBM50554257(CHEMBL4742990)
Affinity DataIC50:  3.85E+3nM. Assay description: Inhibition of human CaMK2beta
Ligand InfoPC cidPC sid
In DepthDetails ArticlePubMed
TargetRho-associated protein kinase 1(Homo sapiens (Human))
Janssen Research & Development
Curated by ChEMBL
LigandPNGBDBM50554257(CHEMBL4742990)
Affinity DataIC50:  246nM. Assay description: Inhibition of human ROCK1
Ligand InfoPC cidPC sid
In DepthDetails ArticlePubMed
TargetAurora kinase A(Homo sapiens (Human))
Janssen Research & Development
Curated by ChEMBL
LigandPNGBDBM50554257(CHEMBL4742990)
Affinity DataIC50:  11nM. Assay description: Inhibition of human Aurora A
Ligand InfoPC cidPC sid
In DepthDetails ArticlePubMed
TargetRibosomal protein S6 kinase alpha-1(Homo sapiens (Human))
Janssen Research & Development
Curated by ChEMBL
LigandPNGBDBM50554257(CHEMBL4742990)
Affinity DataIC50:  483nM. Assay description: Inhibition of RSK1 (unknown origin)
Ligand InfoPC cidPC sid
In DepthDetails ArticlePubMed
TargetRhodopsin kinase GRK7(Homo sapiens (Human))
Janssen Research & Development
Curated by ChEMBL
LigandPNGBDBM50554257(CHEMBL4742990)
Affinity DataIC50:  9.14E+3nM. Assay description: Inhibition of human GRK7
Ligand InfoPC cidPC sid
In DepthDetails ArticlePubMed