BDBM50554272 CHEMBL4751285
SMILES COc1cc(Cn2cnc3ccc(cc3c2=O)-c2cn[nH]c2)ccc1F
InChI Key InChIKey=JMXASZODIJZRQH-UHFFFAOYSA-N
Data  1 IC50
  Tab Delimited (TSV)   2D SDfile   Computed 3D by Vconf -m prep SDfile
Find this compound or compounds like it in BindingDB:
Activity Spreadsheet -- Enzyme Inhibition Constant Data from BindingDB
Found 1 hit for monomerid = 50554272
TargetBeta-adrenergic receptor kinase 1(Homo sapiens (Human))
Janssen Research & Development
Curated by ChEMBL
LigandPNGBDBM50554272(CHEMBL4751285)
Affinity DataIC50:  18nM. Assay description: Inhibition of human GRK2 by transcreener assay
Ligand InfoPC cidPC sid
In DepthDetails ArticlePubMed