BDBM50554695 CHEMBL4760727
SMILES Nc1ncnc2n(cnc12)[C@@H]1O[C@H](CSCCCNCC2Cc3ccc(cc3CN2)[N+]([O-])=O)[C@@H](O)[C@H]1O
InChI Key InChIKey=JBSQEAKLDCYNTH-PNODFLSHSA-N
Data  2 KI
  Tab Delimited (TSV)   2D SDfile   Computed 3D by Vconf -m prep SDfile
Find this compound or compounds like it in BindingDB:
Activity Spreadsheet -- Enzyme Inhibition Constant Data from BindingDB
Found 2 hits for monomerid = 50554695
TargetPhenylethanolamine N-methyltransferase(Homo sapiens (Human))
University Of Kansas
Curated by ChEMBL
LigandPNGBDBM50554695(CHEMBL4760727)
Affinity DataKi:  3.5nM. Assay description: Competitive inhibition of C-terminal hexahistidine tag in human recombinant PNMT expressed in Escherichia coli assessed as inhibition constant using ...
Ligand InfoPC cidPC sid
In DepthDetails ArticlePubMed
TargetAlpha-2A adrenergic receptor(Rattus norvegicus)
University Of Kansas
Curated by ChEMBL
LigandPNGBDBM50554695(CHEMBL4760727)
Affinity DataKi:  3.30E+4nM. Assay description: Displacement of [3H]-clonidine from Sprague-Dawley rat alpha2 adrenergic receptor by radioligand binding assay
Ligand InfoPC cidPC sid
In DepthDetails ArticlePubMed