BDBM50555051 CHEMBL4739996
SMILES CC(C)C[C@@H]1[C@H](CCCOc2ccc(C[C@H](NC1=O)C(=O)N[C@@H](CCC(O)=O)C(O)=O)cc2)C(=O)NO
InChI Key InChIKey=CKCBYWFMRXPHJM-YRPNKDGESA-N
Data  5 KI
  Tab Delimited (TSV)   2D SDfile   Computed 3D by Vconf -m prep SDfile
Find this compound or compounds like it in BindingDB:
Activity Spreadsheet -- Enzyme Inhibition Constant Data from BindingDB
Found 5 hits for monomerid = 50555051
TargetMacrophage metalloelastase(Homo sapiens (Human))
Yale University
Curated by ChEMBL
LigandPNGBDBM50555051(CHEMBL4739996)
Affinity DataKi:  1.20nM. Assay description: Inhibition of human recombinant MMP12 using Mca-Lys-Pro-Leu-Gly-Leu-Dpa-Ala-Arg-NH2 substrate by spectrophotometry
Ligand InfoPC cidPC sid
In DepthDetails ArticlePubMed
TargetMatrilysin(Homo sapiens (Human))
Yale University
Curated by ChEMBL
LigandPNGBDBM50555051(CHEMBL4739996)
Affinity DataKi:  15nM. Assay description: Inhibition of human recombinant MMP7 using Mca-Lys-Pro-Leu-Gly-Leu-Dpa-Ala-Arg-NH2 substrate by spectrophotometry
Ligand InfoPC cidPC sid
In DepthDetails ArticlePubMed
TargetCollagenase 3(Homo sapiens (Human))
Yale University
Curated by ChEMBL
LigandPNGBDBM50555051(CHEMBL4739996)
Affinity DataKi:  89nM. Assay description: Inhibition of human recombinant MMP13 using Mca-Lys-Pro-Leu-Gly-Leu-Dpa-Ala-Arg-NH2 substrate by spectrophotometry
Ligand InfoPC cidPC sid
In DepthDetails ArticlePubMed
Target72 kDa type IV collagenase(Homo sapiens (Human))
Yale University
Curated by ChEMBL
LigandPNGBDBM50555051(CHEMBL4739996)
Affinity DataKi:  396nM. Assay description: Inhibition of human recombinant MMP2 using Mca-Lys-Pro-Leu-Gly-Leu-Dpa-Ala-Arg-NH2 substrate by spectrophotometry
Ligand InfoPC cidPC sid
In DepthDetails ArticlePubMed
TargetMatrix metalloproteinase-9(Homo sapiens (Human))
Yale University
Curated by ChEMBL
LigandPNGBDBM50555051(CHEMBL4739996)
Affinity DataKi:  2.11E+3nM. Assay description: Inhibition of human recombinant MMP9 using Mca-Lys-Pro-Leu-Gly-Leu-Dpa-Ala-Arg-NH2 substrate by spectrophotometry
Ligand InfoPC cidPC sid
In DepthDetails ArticlePubMed