BDBM50795 MLS000081364::SMR000044635::cid_663684
SMILES [H][C@]12[C@H](N3C=Cc4ccccc4C3[C@@]1([H])C(=O)N(C2=O)c1ccc(F)cc1)C(=O)c1ccco1
InChI Key InChIKey=ZLODGQSEXIHXBD-PJEZACDQSA-N
Data  1 IC50
  Tab Delimited (TSV)   2D SDfile   Computed 3D by Vconf -m prep SDfile
Find this compound or compounds like it in BindingDB:
Activity Spreadsheet -- Enzyme Inhibition Constant Data from BindingDB
Found 1 hit for monomerid = 50795
TargetGlycoprotein 42(Human herpesvirus 4 type 2)
Emory University
Curated by PubChem BioAssay
LigandPNGBDBM50795(MLS000081364 | SMR000044635 | cid_663684)
Affinity DataIC50:  5.10E+3nM. Assay description: NIH Molecular Libraries Screening Centers Network [MLSCN] Emory Chemical Biology Discovery Center in MLSCN Assay provider: Theodore Jardetzky; Northw...
In DepthDetails PCBioAssay