BDBM50812 6-amino-1-benzyl-5-[2-(cyclohexen-1-yl)ethylamino]pyrimidine-2,4-dione::6-amino-1-benzyl-5-[2-(cyclohexen-1-yl)ethylamino]pyrimidine-2,4-quinone::6-amino-5-[2-(1-cyclohexenyl)ethylamino]-1-(phenylmethyl)pyrimidine-2,4-dione::6-azanyl-5-[2-(cyclohexen-1-yl)ethylamino]-1-(phenylmethyl)pyrimidine-2,4-dione::MLS000081679::SMR000062886::cid_2363702
SMILES Nc1c(NCCC2=CCCCC2)c(=O)[nH]c(=O)n1Cc1ccccc1
InChI Key InChIKey=OCXITSQBTTTWKI-UHFFFAOYSA-N
Data  1 IC50  2 EC50
  Tab Delimited (TSV)   2D SDfile   Computed 3D by Vconf -m prep SDfile
Find this compound or compounds like it in BindingDB:
Activity Spreadsheet -- Enzyme Inhibition Constant Data from BindingDB
Found 3 hits for monomerid = 50812
TargetPOsterior Segregation(Caenorhabditis elegans)
Broad Institute
Curated by PubChem BioAssay
LigandPNGBDBM50812(6-amino-1-benzyl-5-[2-(cyclohexen-1-yl)ethylamino]...)
Affinity DataEC50:  2.32E+4nM. Assay description: Broad Institute: MLPCN maternal gene expression Project ID: 2024 Keywords: Zinc finger, C. elegans, maternal gene expression, RNA-protein interac...
In DepthDetails PCBioAssay
TargetGlycoprotein 42(Human herpesvirus 4 type 2)
Emory University
Curated by PubChem BioAssay
LigandPNGBDBM50812(6-amino-1-benzyl-5-[2-(cyclohexen-1-yl)ethylamino]...)
Affinity DataIC50:  1.64E+4nM. Assay description: NIH Molecular Libraries Screening Centers Network [MLSCN] Emory Chemical Biology Discovery Center in MLSCN Assay provider: Theodore Jardetzky; Northw...
In DepthDetails PCBioAssay
TargetZinc finger protein mex-5(Caenorhabditis elegans)
Broad Institute
Curated by PubChem BioAssay
LigandPNGBDBM50812(6-amino-1-benzyl-5-[2-(cyclohexen-1-yl)ethylamino]...)
Affinity DataEC50:  1.39E+4nM. Assay description: Broad Institute: MLPCN maternal gene expression Project ID: 2024 Keywords: Zinc finger, C. elegans, maternal gene expression, RNA-protein interac...
In DepthDetails PCBioAssay