BDBM50865 3-(furan-2-carbonyl)-4-hydroxy-1-(5-methyl-1,3,4-thiadiazol-2-yl)-2-(4-propan-2-ylphenyl)-2H-pyrrol-5-one::3-(furan-2-ylcarbonyl)-1-(5-methyl-1,3,4-thiadiazol-2-yl)-4-oxidanyl-2-(4-propan-2-ylphenyl)-2H-pyrrol-5-one::3-[2-furanyl(oxo)methyl]-4-hydroxy-1-(5-methyl-1,3,4-thiadiazol-2-yl)-2-(4-propan-2-ylphenyl)-2H-pyrrol-5-one::4-(2-furoyl)-3-hydroxy-1-(5-methyl-1,3,4-thiadiazol-2-yl)-5-p-cumenyl-3-pyrrolin-2-one::4-(Furan-2-carbonyl)-3-hydroxy-5-(4-isopropyl-phenyl)-1-(5-methyl-[1,3,4]thiadiazol-2-yl)-1,5-dihydro-pyrrol-2-one::MLS000527376::SMR000117850::cid_2910730
SMILES CC(C)c1ccc(cc1)C1C(C(=O)c2ccco2)C(=O)C(=O)N1c1nnc(C)s1
InChI Key InChIKey=OEFDADDUKUVRTO-UHFFFAOYSA-N
Data  1 IC50
  Tab Delimited (TSV)   2D SDfile   Computed 3D by Vconf -m prep SDfile
Find this compound or compounds like it in BindingDB:
Activity Spreadsheet -- Enzyme Inhibition Constant Data from BindingDB
Found 1 hit for monomerid = 50865
TargetGlycoprotein 42(Human herpesvirus 4 type 2)
Emory University
Curated by PubChem BioAssay
LigandPNGBDBM50865(3-(furan-2-carbonyl)-4-hydroxy-1-(5-methyl-1,3,4-t...)
Affinity DataIC50:  1.19E+3nM. Assay description: NIH Molecular Libraries Screening Centers Network [MLSCN] Emory Chemical Biology Discovery Center in MLSCN Assay provider: Theodore Jardetzky; Northw...
In DepthDetails PCBioAssay