BDBM50882 (4Z)-2-(5-methyl-3-phenyl-isoxazol-4-yl)-4-veratrylidene-2-oxazolin-5-one::(4Z)-4-[(3,4-dimethoxyphenyl)methylidene]-2-(5-methyl-3-phenyl-1,2-oxazol-4-yl)-1,3-oxazol-5-one::(4Z)-4-[(3,4-dimethoxyphenyl)methylidene]-2-(5-methyl-3-phenyl-4-isoxazolyl)-5-oxazolone::MLS000518977::SMR000129397::cid_5883673
SMILES COc1ccc(\C=C2/N=C(OC2=O)c2c(C)onc2-c2ccccc2)cc1OC
InChI Key InChIKey=YYJDQVLZNONKNX-WJDWOHSUSA-N
Data  1 IC50
  Tab Delimited (TSV)   2D SDfile   Computed 3D by Vconf -m prep SDfile
Find this compound or compounds like it in BindingDB:
Activity Spreadsheet -- Enzyme Inhibition Constant Data from BindingDB
Found 1 hit for monomerid = 50882
TargetGlycoprotein 42(Human herpesvirus 4 type 2)
Emory University
Curated by PubChem BioAssay
LigandPNGBDBM50882((4Z)-2-(5-methyl-3-phenyl-isoxazol-4-yl)-4-veratry...)
Affinity DataIC50:  1.24E+4nM. Assay description: NIH Molecular Libraries Screening Centers Network [MLSCN] Emory Chemical Biology Discovery Center in MLSCN Assay provider: Theodore Jardetzky; Northw...
In DepthDetails PCBioAssay