BDBM51463 MLS000034110::N-methyl-N-(5-pyridin-2-yl-1,3,4-thiadiazol-2-yl)oxolane-2-carboxamide::N-methyl-N-[5-(2-pyridinyl)-1,3,4-thiadiazol-2-yl]-2-oxolanecarboxamide::N-methyl-N-[5-(2-pyridyl)-1,3,4-thiadiazol-2-yl]tetrahydrofuran-2-carboxamide::SMR000000567::Tetrahydro-furan-2-carboxylic acid methyl-(5-pyridin-2-yl-[1,3,4]thiadiazol-2-yl)-amide::cid_651516
SMILES CN(C(=O)C1CCCO1)c1nnc(s1)-c1ccccn1
InChI Key InChIKey=NMUUTGGNAOSULT-UHFFFAOYSA-N
Data  1 IC50
  Tab Delimited (TSV)   2D SDfile   Computed 3D by Vconf -m prep SDfile
Find this compound or compounds like it in BindingDB:
Activity Spreadsheet -- Enzyme Inhibition Constant Data from BindingDB
Found 1 hit for monomerid = 51463
TargetdTDP-4-dehydrorhamnose 3,5-epimerase(Mycobacterium tuberculosis H37Rv)
Pcmd
Curated by PubChem BioAssay
LigandPNGBDBM51463(MLS000034110 | N-methyl-N-(5-pyridin-2-yl-1,3,4-th...)
Affinity DataIC50:  1.31E+3nM. Assay description: Molecular Library Screening Center Network (MLSCN) Penn Center for Molecular Discovery (PCMD) Assay Provider: Michael McNeil, Colorado State Universi...
In DepthDetails PCBioAssay