BDBM51498 6-chloranyl-8-[(4-methylpiperazin-1-yl)methyl]-7-oxidanyl-4-propyl-chromen-2-one::6-chloro-7-hydroxy-8-[(4-methyl-1-piperazinyl)methyl]-4-propyl-1-benzopyran-2-one::6-chloro-7-hydroxy-8-[(4-methylpiperazin-1-yl)methyl]-4-propylchromen-2-one::6-chloro-7-hydroxy-8-[(4-methylpiperazino)methyl]-4-propyl-coumarin::MLS000081046::SMR000042925::cid_5389495
SMILES CCCc1cc(=O)oc2c(CN3CCN(C)CC3)c(O)c(Cl)cc12
InChI Key InChIKey=SFHKWMHJVSCOSC-UHFFFAOYSA-N
Data  2 IC50  1 EC50
  Tab Delimited (TSV)   2D SDfile   Computed 3D by Vconf -m prep SDfile
Find this compound or compounds like it in BindingDB:
Activity Spreadsheet -- Enzyme Inhibition Constant Data from BindingDB
Found 3 hits for monomerid = 51498
TargetdTDP-4-dehydrorhamnose 3,5-epimerase(Mycobacterium tuberculosis H37Rv)
Pcmd
Curated by PubChem BioAssay
LigandPNGBDBM51498(6-chloranyl-8-[(4-methylpiperazin-1-yl)methyl]-7-o...)
Affinity DataIC50:  677nM. Assay description: Molecular Library Screening Center Network (MLSCN) Penn Center for Molecular Discovery (PCMD) Assay Provider: Michael McNeil, Colorado State Universi...
In DepthDetails PCBioAssay
TargetImportin subunit alpha-1(Homo sapiens (Human))
Broad Institute
Curated by PubChem BioAssay
LigandPNGBDBM51498(6-chloranyl-8-[(4-methylpiperazin-1-yl)methyl]-7-o...)
Affinity DataEC50:  3.14E+4nM. Assay description: Keywords: Counterscreen, FRET assay, HTS, YIC probe, Dose response, Assay Overview: This is a fluorescence resonance energy transfer (FRET)-based b...
In DepthDetails PCBioAssay
TargetM1 family aminopeptidase(Plasmodium falciparum (isolate FcB1 / Columbia))
Srmlsc
Curated by PubChem BioAssay
LigandPNGBDBM51498(6-chloranyl-8-[(4-methylpiperazin-1-yl)methyl]-7-o...)
Affinity DataIC50:  4.20E+4nM. Assay description: Southern Research Molecular Libraries Screening Center (SRMLSC) Southern Research Institute (Birmingham, Alabama) NIH Molecular Libraries Screening...
In DepthDetails PCBioAssay