BDBM51534 (2-oxidanylideneoxolan-3-yl) 1-(4-fluorophenyl)-3-methyl-thieno[2,3-c]pyrazole-5-carboxylate::(2-oxooxolan-3-yl) 1-(4-fluorophenyl)-3-methylthieno[2,3-c]pyrazole-5-carboxylate::1-(4-fluorophenyl)-3-methyl-5-thieno[2,3-c]pyrazolecarboxylic acid (2-oxo-3-oxolanyl) ester::1-(4-fluorophenyl)-3-methyl-thieno[2,3-c]pyrazole-5-carboxylic acid (2-ketotetrahydrofuran-3-yl) ester::MLS000058712::SMR000067217::cid_2999178
SMILES Cc1nn(-c2ccc(F)cc2)c2sc(cc12)C(=O)OC1CCOC1=O
InChI Key InChIKey=NZSWRFJIZIXLGX-UHFFFAOYSA-N
Data  1 IC50
  Tab Delimited (TSV)   2D SDfile   Computed 3D by Vconf -m prep SDfile
Find this compound or compounds like it in BindingDB:
Activity Spreadsheet -- Enzyme Inhibition Constant Data from BindingDB
Found 1 hit for monomerid = 51534
TargetdTDP-4-dehydrorhamnose 3,5-epimerase(Mycobacterium tuberculosis H37Rv)
Pcmd
Curated by PubChem BioAssay
LigandPNGBDBM51534((2-oxidanylideneoxolan-3-yl) 1-(4-fluorophenyl)-3-...)
Affinity DataIC50:  4.57E+3nM. Assay description: Molecular Library Screening Center Network (MLSCN) Penn Center for Molecular Discovery (PCMD) Assay Provider: Michael McNeil, Colorado State Universi...
In DepthDetails PCBioAssay