BDBM51909 2-[2-[(3-methoxyphenoxy)methyl]-3-methyl-1-benzimidazol-3-iumyl]acetic acid decyl ester;chloride::2-[2-[(3-methoxyphenoxy)methyl]-3-methyl-benzimidazol-3-ium-1-yl]acetic acid decyl ester;chloride::MLS001164083::SMR000539389::cid_24747369::decyl 2-[2-[(3-methoxyphenoxy)methyl]-3-methyl-benzimidazol-3-ium-1-yl]ethanoate;chloride::decyl 2-[2-[(3-methoxyphenoxy)methyl]-3-methylbenzimidazol-3-ium-1-yl]acetate;chloride
SMILES CCCCCCCCCCOC(=O)Cn1c(COc2cccc(OC)c2)[n+](C)c2ccccc12
InChI Key InChIKey=VZAABTACONNWBS-UHFFFAOYSA-N
Data  4 IC50  3 EC50
  Tab Delimited (TSV)   2D SDfile   Computed 3D by Vconf -m prep SDfile
Find this compound or compounds like it in BindingDB:
Activity Spreadsheet -- Enzyme Inhibition Constant Data from BindingDB
Found 7 hits for monomerid = 51909
LigandPNGBDBM51909(2-[2-[(3-methoxyphenoxy)methyl]-3-methyl-1-benzimi...)
Affinity DataEC50:  2.15E+4nM. Assay description: University of New Mexico Assay Overview: Assay Support: 1R03MH084830-01 Project Title: TR-FRET HTS Assay for Inhibitors of MEKK2-MEK5 PB1 Domain...
In DepthDetails PCBioAssay
LigandPNGBDBM51909(2-[2-[(3-methoxyphenoxy)methyl]-3-methyl-1-benzimi...)
Affinity DataEC50:  4.33E+3nM. Assay description: University of New Mexico Assay Overview: Assay Support: 1R03MH084830-01 Project Title: TR-FRET HTS Assay for Inhibitors of MEKK2-MEK5 PB1 Domain...
In DepthDetails PCBioAssay
TargetNeurotensin receptor type 1(Homo sapiens (Human))
Burnham Center For Chemical Genomics
Curated by PubChem BioAssay
LigandPNGBDBM51909(2-[2-[(3-methoxyphenoxy)methyl]-3-methyl-1-benzimi...)
Affinity DataEC50:  1.43E+4nM. Assay description: Data Source: Sanford-Burnham Center for Chemical Genomics (SBCCG) Source Affiliation: Sanford-Burnham Medical Research Institute (SBMRI, San Diego, C...
In DepthDetails PCBioAssay
TargetApoptotic protease-activating factor 1(Homo sapiens (Human))
Burnham Center For Chemical Genomics
Curated by PubChem BioAssay
LigandPNGBDBM51909(2-[2-[(3-methoxyphenoxy)methyl]-3-methyl-1-benzimi...)
Affinity DataIC50: >1.00E+5nM. Assay description: Data Source: Sanford-Burnham Center for Chemical Genomics (SBCCG) Source Affiliation: Sanford-Burnham Medical Research Institute (SBIMR, San Diego, C...
In DepthDetails PCBioAssay
TargetCaspase-9(Homo sapiens (Human))
Burnham Center For Chemical Genomics
Curated by PubChem BioAssay
LigandPNGBDBM51909(2-[2-[(3-methoxyphenoxy)methyl]-3-methyl-1-benzimi...)
Affinity DataIC50:  1.57E+4nM. Assay description: Data Source: Sanford-Burnham Center for Chemical Genomics (SBCCG) Source Affiliation: Sanford-Burnham Medical Research Institute (SBIMR, San Diego, C...
In DepthDetails PCBioAssay
TargetApoptotic protease-activating factor 1(Homo sapiens (Human))
Burnham Center For Chemical Genomics
Curated by PubChem BioAssay
LigandPNGBDBM51909(2-[2-[(3-methoxyphenoxy)methyl]-3-methyl-1-benzimi...)
Affinity DataIC50:  1.02E+4nM. Assay description: Data Source: Sanford-Burnham Center for Chemical Genomics (SBCCG) Source Affiliation: Sanford-Burnham Medical Research Institute (SBIMR, San Diego, C...
In DepthDetails PCBioAssay
TargetUbiquitin-conjugating enzyme E2 N(Homo sapiens (Human))
Burnham Center For Chemical Genomics
Curated by PubChem BioAssay
LigandPNGBDBM51909(2-[2-[(3-methoxyphenoxy)methyl]-3-methyl-1-benzimi...)
Affinity DataIC50: >2.00E+4nM. Assay description: Data Source: Sanford-Burnham Center for Chemical Genomics (SBCCG) Source Affiliation: Sanford-Burnham Medical Research Institute (SBMRI, San Diego CA...
In DepthDetails PCBioAssay