BDBM51912 MLS001165417::SMR000540006::[(3Z)-3-(2-chloranylthioxanthen-9-ylidene)propyl]-decyl-dimethyl-azanium;bromide::[(3Z)-3-(2-chloro-9-thioxanthenylidene)propyl]-decyl-dimethylammonium;bromide::[(3Z)-3-(2-chlorothioxanthen-9-ylidene)propyl]-decyl-dimethyl-ammonium;bromide::[(3Z)-3-(2-chlorothioxanthen-9-ylidene)propyl]-decyl-dimethylazanium;bromide::cid_24747730
SMILES CCCCCCCCCC[N+](C)(C)CC\C=C1\c2ccccc2Sc2ccc(Cl)cc12
InChI Key InChIKey=WKPFAGPWDYWJJR-JLPGSUDCSA-N
Data  6 IC50  4 EC50
  Tab Delimited (TSV)   2D SDfile   Computed 3D by Vconf -m prep SDfile
Find this compound or compounds like it in BindingDB:
Activity Spreadsheet -- Enzyme Inhibition Constant Data from BindingDB
Found 10 hits for monomerid = 51912
LigandPNGBDBM51912(MLS001165417 | SMR000540006 | [(3Z)-3-(2-chloranyl...)
Affinity DataEC50:  3.00E+4nM. Assay description: University of New Mexico Assay Overview: Assay Support: 1R03MH084830-01 Project Title: TR-FRET HTS Assay for Inhibitors of MEKK2-MEK5 PB1 Domain...
In DepthDetails PCBioAssay
LigandPNGBDBM51912(MLS001165417 | SMR000540006 | [(3Z)-3-(2-chloranyl...)
Affinity DataEC50:  2.24E+3nM. Assay description: University of New Mexico Assay Overview: Assay Support: 1R03MH084830-01 Project Title: TR-FRET HTS Assay for Inhibitors of MEKK2-MEK5 PB1 Domain...
In DepthDetails PCBioAssay
TargetStreptokinase A(Streptococcus pyogenes M1 GAS)
Broad Institute
Curated by PubChem BioAssay
LigandPNGBDBM51912(MLS001165417 | SMR000540006 | [(3Z)-3-(2-chloranyl...)
Affinity DataEC50:  6.63E+3nM. Assay description: Keywords: Group A streptococcus, GAS, streptokinase, expression, virulence, inhibition, dose response, EC50 Assay Overview: The goal of this assa...
In DepthDetails PCBioAssay
TargetSerine/threonine-protein kinase 33(Homo sapiens (Human))
Broad Institute
Curated by PubChem BioAssay
LigandPNGBDBM51912(MLS001165417 | SMR000540006 | [(3Z)-3-(2-chloranyl...)
Affinity DataEC50: >1.20E+5nM. Assay description: Keywords: STK33 Kinase, Non-ATP Competitive Inhibitor Assay Overview: Purified STK33 Kinase is preincubated with potential inhibitors and allowed to ...
In DepthDetails PCBioAssay
TargetApoptotic protease-activating factor 1(Homo sapiens (Human))
Burnham Center For Chemical Genomics
Curated by PubChem BioAssay
LigandPNGBDBM51912(MLS001165417 | SMR000540006 | [(3Z)-3-(2-chloranyl...)
Affinity DataIC50: >1.00E+5nM. Assay description: Data Source: Sanford-Burnham Center for Chemical Genomics (SBCCG) Source Affiliation: Sanford-Burnham Medical Research Institute (SBIMR, San Diego, C...
In DepthDetails PCBioAssay
TargetUbiquitin-conjugating enzyme E2 N(Homo sapiens (Human))
Burnham Center For Chemical Genomics
Curated by PubChem BioAssay
LigandPNGBDBM51912(MLS001165417 | SMR000540006 | [(3Z)-3-(2-chloranyl...)
Affinity DataIC50:  4.61E+3nM. Assay description: Data Source: Sanford-Burnham Center for Chemical Genomics (SBCCG) Source Affiliation: Sanford-Burnham Medical Research Institute (SBMRI, San Diego CA...
In DepthDetails PCBioAssay
TargetUbiquitin-conjugating enzyme E2 N(Homo sapiens (Human))
Burnham Center For Chemical Genomics
Curated by PubChem BioAssay
LigandPNGBDBM51912(MLS001165417 | SMR000540006 | [(3Z)-3-(2-chloranyl...)
Affinity DataIC50:  3.77E+3nM. Assay description: Data Source: Sanford-Burnham Center for Chemical Genomics (SBCCG) Source Affiliation: Sanford-Burnham Medical Research Institute (SBMRI, San Diego CA...
In DepthDetails PCBioAssay
TargetCaspase-9(Homo sapiens (Human))
Burnham Center For Chemical Genomics
Curated by PubChem BioAssay
LigandPNGBDBM51912(MLS001165417 | SMR000540006 | [(3Z)-3-(2-chloranyl...)
Affinity DataIC50:  1.52E+4nM. Assay description: Data Source: Sanford-Burnham Center for Chemical Genomics (SBCCG) Source Affiliation: Sanford-Burnham Medical Research Institute (SBIMR, San Diego, C...
In DepthDetails PCBioAssay
TargetApoptotic protease-activating factor 1(Homo sapiens (Human))
Burnham Center For Chemical Genomics
Curated by PubChem BioAssay
LigandPNGBDBM51912(MLS001165417 | SMR000540006 | [(3Z)-3-(2-chloranyl...)
Affinity DataIC50:  1.06E+4nM. Assay description: Data Source: Sanford-Burnham Center for Chemical Genomics (SBCCG) Source Affiliation: Sanford-Burnham Medical Research Institute (SBIMR, San Diego, C...
In DepthDetails PCBioAssay
TargetBcl-2-related protein A1(Mus musculus (Mouse))
Burnham Center For Chemical Genomics
Curated by PubChem BioAssay
LigandPNGBDBM51912(MLS001165417 | SMR000540006 | [(3Z)-3-(2-chloranyl...)
Affinity DataIC50:  8.08E+3nM. Assay description: Data Source: Sanford-Burnham Center for Chemical Genomics (SBCCG) Source Affiliation: Sanford-Burnham Medical Research Institute (SBMRI, San Diego CA...
In DepthDetails PCBioAssay