BDBM52199 2-amino-4-asaryl-5-keto-7-methyl-4,6,7,8-tetrahydrochromene-3-carbonitrile::2-amino-7-methyl-5-oxo-4-(2,4,5-trimethoxyphenyl)-4,6,7,8-tetrahydro-1-benzopyran-3-carbonitrile::2-amino-7-methyl-5-oxo-4-(2,4,5-trimethoxyphenyl)-4,6,7,8-tetrahydrochromene-3-carbonitrile::2-azanyl-7-methyl-5-oxidanylidene-4-(2,4,5-trimethoxyphenyl)-4,6,7,8-tetrahydrochromene-3-carbonitrile::MLS000105469::SMR000102350::cid_2839017
SMILES COc1cc(OC)c(cc1OC)C1C(C#N)C(=N)OC2=C1C(=O)CC(C)C2
InChI Key InChIKey=RBXJOJHTHSBDHW-UHFFFAOYSA-N
Data  2 EC50
  Tab Delimited (TSV)   2D SDfile   Computed 3D by Vconf -m prep SDfile
Find this compound or compounds like it in BindingDB:
Activity Spreadsheet -- Enzyme Inhibition Constant Data from BindingDB
Found 2 hits for monomerid = 52199
TargetZinc finger protein mex-5(Caenorhabditis elegans)
Broad Institute
Curated by PubChem BioAssay
LigandPNGBDBM52199(2-amino-4-asaryl-5-keto-7-methyl-4,6,7,8-tetrahydr...)
Affinity DataEC50:  3.00E+5nM. Assay description: Broad Institute: MLPCN maternal gene expression Project ID: 2024 Keywords: Zinc finger, C. elegans, maternal gene expression, RNA-protein interac...
In DepthDetails PCBioAssay
TargetPOsterior Segregation(Caenorhabditis elegans)
Broad Institute
Curated by PubChem BioAssay
LigandPNGBDBM52199(2-amino-4-asaryl-5-keto-7-methyl-4,6,7,8-tetrahydr...)
Affinity DataEC50:  3.00E+5nM. Assay description: Broad Institute: MLPCN maternal gene expression Project ID: 2024 Keywords: Zinc finger, C. elegans, maternal gene expression, RNA-protein interac...
In DepthDetails PCBioAssay