BDBM52264 4-keto-8-methyl-N-p-anisyl-pyrido[1,2-a]pyrimidine-3-carboxamide::MLS000529946::N-[(4-methoxyphenyl)methyl]-8-methyl-4-oxidanylidene-pyrido[1,2-a]pyrimidine-3-carboxamide::N-[(4-methoxyphenyl)methyl]-8-methyl-4-oxo-3-pyrido[1,2-a]pyrimidinecarboxamide::N-[(4-methoxyphenyl)methyl]-8-methyl-4-oxopyrido[1,2-a]pyrimidine-3-carboxamide::SMR000127034::cid_4151343
SMILES COc1ccc(CNC(=O)c2cnc3cc(C)ccn3c2=O)cc1
InChI Key InChIKey=MWYMANQQXPIBJJ-UHFFFAOYSA-N
Data  2 EC50
  Tab Delimited (TSV)   2D SDfile   Computed 3D by Vconf -m prep SDfile
Find this compound or compounds like it in BindingDB:
Activity Spreadsheet -- Enzyme Inhibition Constant Data from BindingDB
Found 2 hits for monomerid = 52264
TargetZinc finger protein mex-5(Caenorhabditis elegans)
Broad Institute
Curated by PubChem BioAssay
LigandPNGBDBM52264(4-keto-8-methyl-N-p-anisyl-pyrido[1,2-a]pyrimidine...)
Affinity DataEC50:  3.00E+5nM. Assay description: Broad Institute: MLPCN maternal gene expression Project ID: 2024 Keywords: Zinc finger, C. elegans, maternal gene expression, RNA-protein interac...
In DepthDetails PCBioAssay
TargetPOsterior Segregation(Caenorhabditis elegans)
Broad Institute
Curated by PubChem BioAssay
LigandPNGBDBM52264(4-keto-8-methyl-N-p-anisyl-pyrido[1,2-a]pyrimidine...)
Affinity DataEC50:  3.00E+5nM. Assay description: Broad Institute: MLPCN maternal gene expression Project ID: 2024 Keywords: Zinc finger, C. elegans, maternal gene expression, RNA-protein interac...
In DepthDetails PCBioAssay