BDBM52634 2-(4-keto-2-thioxo-thiazolidin-3-yl)-4-nitro-isoindoline-1,3-quinone::4-nitro-2-(4-oxidanylidene-2-sulfanylidene-1,3-thiazolidin-3-yl)isoindole-1,3-dione::4-nitro-2-(4-oxo-2-sulfanylidene-1,3-thiazolidin-3-yl)isoindole-1,3-dione::4-nitro-2-(4-oxo-2-sulfanylidene-3-thiazolidinyl)isoindole-1,3-dione::4-nitro-2-(4-oxo-2-thioxo-1,3-thiazolidin-3-yl)-1H-isoindole-1,3(2H)-dione::MLS000677180::SMR000271009::cid_2294296
SMILES Oc1csc(=S)n1N1C(=O)c2cccc(c2C1=O)[N+]([O-])=O
InChI Key InChIKey=AVTLFZBHHOUKCS-UHFFFAOYSA-N
Data  2 EC50
  Tab Delimited (TSV)   2D SDfile   Computed 3D by Vconf -m prep SDfile
Find this compound or compounds like it in BindingDB:
Activity Spreadsheet -- Enzyme Inhibition Constant Data from BindingDB
Found 2 hits for monomerid = 52634
TargetZinc finger protein mex-5(Caenorhabditis elegans)
Broad Institute
Curated by PubChem BioAssay
LigandPNGBDBM52634(2-(4-keto-2-thioxo-thiazolidin-3-yl)-4-nitro-isoin...)
Affinity DataEC50:  2.48E+4nM. Assay description: Broad Institute: MLPCN maternal gene expression Project ID: 2024 Keywords: Zinc finger, C. elegans, maternal gene expression, RNA-protein interac...
In DepthDetails PCBioAssay
TargetPOsterior Segregation(Caenorhabditis elegans)
Broad Institute
Curated by PubChem BioAssay
LigandPNGBDBM52634(2-(4-keto-2-thioxo-thiazolidin-3-yl)-4-nitro-isoin...)
Affinity DataEC50:  2.49E+4nM. Assay description: Broad Institute: MLPCN maternal gene expression Project ID: 2024 Keywords: Zinc finger, C. elegans, maternal gene expression, RNA-protein interac...
In DepthDetails PCBioAssay