BDBM52652 4-(4-pyridyl)-8-(trifluoromethyl)-3a,4,5,9b-tetrahydro-3H-cyclopenta[c]quinoline::4-pyridin-4-yl-8-(trifluoromethyl)-3a,4,5,9b-tetrahydro-3H-cyclopenta[c]quinoline::MLS000706693::SMR000288145::cid_2947620
SMILES FC(F)(F)c1ccc2NC(C3CC=CC3c2c1)c1ccncc1
InChI Key InChIKey=FSQBWEBXNBGAOY-UHFFFAOYSA-N
Data  2 EC50
  Tab Delimited (TSV)   2D SDfile   Computed 3D by Vconf -m prep SDfile
Find this compound or compounds like it in BindingDB:
Activity Spreadsheet -- Enzyme Inhibition Constant Data from BindingDB
Found 2 hits for monomerid = 52652
TargetZinc finger protein mex-5(Caenorhabditis elegans)
Broad Institute
Curated by PubChem BioAssay
LigandPNGBDBM52652(4-(4-pyridyl)-8-(trifluoromethyl)-3a,4,5,9b-tetrah...)
Affinity DataEC50:  3.00E+5nM. Assay description: Broad Institute: MLPCN maternal gene expression Project ID: 2024 Keywords: Zinc finger, C. elegans, maternal gene expression, RNA-protein interac...
In DepthDetails PCBioAssay
TargetPOsterior Segregation(Caenorhabditis elegans)
Broad Institute
Curated by PubChem BioAssay
LigandPNGBDBM52652(4-(4-pyridyl)-8-(trifluoromethyl)-3a,4,5,9b-tetrah...)
Affinity DataEC50:  3.00E+5nM. Assay description: Broad Institute: MLPCN maternal gene expression Project ID: 2024 Keywords: Zinc finger, C. elegans, maternal gene expression, RNA-protein interac...
In DepthDetails PCBioAssay