BDBM52667 5-[3-((E)-{[3-(dimethylamino)benzoyl]hydrazono}methyl)-2,5-dimethyl-1H-pyrrol-1-yl]isophthalic acid::5-[3-[[[3-(dimethylamino)benzoyl]hydrazinylidene]methyl]-2,5-dimethylpyrrol-1-yl]benzene-1,3-dicarboxylic acid::5-[3-[[[3-(dimethylamino)benzoyl]hydrazono]methyl]-2,5-dimethyl-pyrrol-1-yl]isophthalic acid::5-[3-[[[3-(dimethylamino)phenyl]carbonylhydrazinylidene]methyl]-2,5-dimethyl-pyrrol-1-yl]benzene-1,3-dicarboxylic acid::5-[3-[[[[3-(dimethylamino)phenyl]-oxomethyl]hydrazinylidene]methyl]-2,5-dimethyl-1-pyrrolyl]benzene-1,3-dicarboxylic acid::MLS000682937::SMR000313020::cid_16194186
SMILES CN(C)c1cccc(c1)C(=O)NN=Cc1cc(C)n(c1C)-c1cc(cc(c1)C(O)=O)C(O)=O
InChI Key InChIKey=IGIJYSJRSGLAGQ-UHFFFAOYSA-N
Data  3 IC50  2 EC50
  Tab Delimited (TSV)   2D SDfile   Computed 3D by Vconf -m prep SDfile
Find this compound or compounds like it in BindingDB:
Activity Spreadsheet -- Enzyme Inhibition Constant Data from BindingDB
Found 5 hits for monomerid = 52667
TargetPOsterior Segregation(Caenorhabditis elegans)
Broad Institute
Curated by PubChem BioAssay
LigandPNGBDBM52667(5-[3-((E)-{[3-(dimethylamino)benzoyl]hydrazono}met...)
Affinity DataEC50:  3.00E+5nM. Assay description: Broad Institute: MLPCN maternal gene expression Project ID: 2024 Keywords: Zinc finger, C. elegans, maternal gene expression, RNA-protein interac...
In DepthDetails PCBioAssay
TargetZinc finger protein mex-5(Caenorhabditis elegans)
Broad Institute
Curated by PubChem BioAssay
LigandPNGBDBM52667(5-[3-((E)-{[3-(dimethylamino)benzoyl]hydrazono}met...)
Affinity DataEC50:  1.43E+5nM. Assay description: Broad Institute: MLPCN maternal gene expression Project ID: 2024 Keywords: Zinc finger, C. elegans, maternal gene expression, RNA-protein interac...
In DepthDetails PCBioAssay
TargetCarboxy-terminal domain RNA polymerase II polypeptide A small phosphatase 1(Homo sapiens (Human))
Burnham Center For Chemical Genomics
Curated by PubChem BioAssay
LigandPNGBDBM52667(5-[3-((E)-{[3-(dimethylamino)benzoyl]hydrazono}met...)
Affinity DataIC50:  2.07E+3nM. Assay description: Data Source: Sanford-Burnham Center for Chemical Genomics (SBCCG) Source Affiliation: Sanford-Burnham Medical Research Institute (SBMRI, San Diego, C...
In DepthDetails PCBioAssay
TargetDNA dC->dU-editing enzyme APOBEC-3G(Homo sapiens (Human))
Burnham Center For Chemical Genomics
Curated by PubChem BioAssay
LigandPNGBDBM52667(5-[3-((E)-{[3-(dimethylamino)benzoyl]hydrazono}met...)
Affinity DataIC50:  2.06E+4nMT: 2°C. Assay description: Data Source: Sanford-Burnham Center for Chemical Genomics (SBCCG) Source Affiliation: Sanford-Burnham Medical Research Institute (SBMRI, San Diego, C...
In DepthDetails PCBioAssay
TargetDNA dC->dU-editing enzyme APOBEC-3A(Homo sapiens (Human))
Burnham Center For Chemical Genomics
Curated by PubChem BioAssay
LigandPNGBDBM52667(5-[3-((E)-{[3-(dimethylamino)benzoyl]hydrazono}met...)
Affinity DataIC50:  9.31E+3nMT: 2°C. Assay description: Data Source: Sanford-Burnham Center for Chemical Genomics (SBCCG) Source Affiliation: Sanford-Burnham Medical Research Institute (SBMRI, San Diego, C...
In DepthDetails PCBioAssay