BDBM52701 4-[(5-methyl-1H-1,2,4-triazol-3-yl)hydrazinylidene]-1-cyclohexa-2,5-dienone::4-[(5-methyl-1H-1,2,4-triazol-3-yl)hydrazinylidene]cyclohexa-2,5-dien-1-one::4-[(5-methyl-1H-1,2,4-triazol-3-yl)hydrazono]cyclohexa-2,5-dien-1-one::MLS000703169::SMR000273633::cid_5990451
SMILES Cc1nnc(N=Nc2ccc(O)cc2)[nH]1
InChI Key InChIKey=ZEUCMUNWWGISSI-UHFFFAOYSA-N
Data  1 IC50  2 EC50
  Tab Delimited (TSV)   2D SDfile   Computed 3D by Vconf -m prep SDfile
Find this compound or compounds like it in BindingDB:
Activity Spreadsheet -- Enzyme Inhibition Constant Data from BindingDB
Found 3 hits for monomerid = 52701
TargetPOsterior Segregation(Caenorhabditis elegans)
Broad Institute
Curated by PubChem BioAssay
LigandPNGBDBM52701(4-[(5-methyl-1H-1,2,4-triazol-3-yl)hydrazinylidene...)
Affinity DataEC50:  3.00E+5nM. Assay description: Broad Institute: MLPCN maternal gene expression Project ID: 2024 Keywords: Zinc finger, C. elegans, maternal gene expression, RNA-protein interac...
In DepthDetails PCBioAssay
TargetGroup 3 secretory phospholipase A2(Homo sapiens)
The Scripps Research Institute Molecular Screening Center
Curated by PubChem BioAssay
LigandPNGBDBM52701(4-[(5-methyl-1H-1,2,4-triazol-3-yl)hydrazinylidene...)
Affinity DataIC50:  2.05E+4nM. Assay description: Source (MLPCN Center Name): The Scripps Research Institute Molecular Screening Center Affiliation: The Scripps Research Institute, TSRI Assay Provide...
In DepthDetails PCBioAssay
TargetZinc finger protein mex-5(Caenorhabditis elegans)
Broad Institute
Curated by PubChem BioAssay
LigandPNGBDBM52701(4-[(5-methyl-1H-1,2,4-triazol-3-yl)hydrazinylidene...)
Affinity DataEC50:  4.83E+3nM. Assay description: Broad Institute: MLPCN maternal gene expression Project ID: 2024 Keywords: Zinc finger, C. elegans, maternal gene expression, RNA-protein interac...
In DepthDetails PCBioAssay