BDBM52750 4-(2-amino-3-cyano-5-oxo-5,6,7,8-tetrahydro-4H-chromen-4-yl)-2,6-dimethoxyphenyl morpholine-4-carboxylate::4-morpholinecarboxylic acid [4-(2-amino-3-cyano-5-oxo-4,6,7,8-tetrahydro-1-benzopyran-4-yl)-2,6-dimethoxyphenyl] ester::MLS000878857::SMR000020953::[4-(2-amino-3-cyano-5-oxo-4,6,7,8-tetrahydrochromen-4-yl)-2,6-dimethoxyphenyl] morpholine-4-carboxylate::[4-(2-azanyl-3-cyano-5-oxidanylidene-4,6,7,8-tetrahydrochromen-4-yl)-2,6-dimethoxy-phenyl] morpholine-4-carboxylate::cid_3244863::morpholine-4-carboxylic acid [4-(2-amino-3-cyano-5-keto-4,6,7,8-tetrahydrochromen-4-yl)-2,6-dimethoxy-phenyl] ester
SMILES COc1cc(cc(OC)c1OC(=O)N1CCOCC1)C1C(C#N)C(=N)OC2=C1C(=O)CCC2
InChI Key InChIKey=WNGLGOHPUOBWDP-UHFFFAOYSA-N
Data  2 EC50
  Tab Delimited (TSV)   2D SDfile   Computed 3D by Vconf -m prep SDfile
Find this compound or compounds like it in BindingDB:
Activity Spreadsheet -- Enzyme Inhibition Constant Data from BindingDB
Found 2 hits for monomerid = 52750
TargetZinc finger protein mex-5(Caenorhabditis elegans)
Broad Institute
Curated by PubChem BioAssay
LigandPNGBDBM52750(4-(2-amino-3-cyano-5-oxo-5,6,7,8-tetrahydro-4H-chr...)
Affinity DataEC50:  3.00E+5nM. Assay description: Broad Institute: MLPCN maternal gene expression Project ID: 2024 Keywords: Zinc finger, C. elegans, maternal gene expression, RNA-protein interac...
In DepthDetails PCBioAssay
TargetPOsterior Segregation(Caenorhabditis elegans)
Broad Institute
Curated by PubChem BioAssay
LigandPNGBDBM52750(4-(2-amino-3-cyano-5-oxo-5,6,7,8-tetrahydro-4H-chr...)
Affinity DataEC50:  3.00E+5nM. Assay description: Broad Institute: MLPCN maternal gene expression Project ID: 2024 Keywords: Zinc finger, C. elegans, maternal gene expression, RNA-protein interac...
In DepthDetails PCBioAssay