BDBM52772 (3Z)-3-[2-(4-methylphenyl)-2-oxidanylidene-ethylidene]-4H-1,4-benzoxazin-2-one::(3Z)-3-[2-(4-methylphenyl)-2-oxoethylidene]-4H-1,4-benzoxazin-2-one::(3Z)-3-[2-keto-2-(p-tolyl)ethylidene]-4H-1,4-benzoxazin-2-one::3-[2-Oxo-2-p-tolyl-eth-(E)-ylidene]-3,4-dihydro-benzo[1,4]oxazin-2-one::MLS001029841::SMR000427704::cid_5539232
SMILES Cc1ccc(cc1)C(=O)Cc1nc2ccccc2oc1=O
InChI Key InChIKey=UMFNWLDFPNENMU-UHFFFAOYSA-N
Data  3 EC50
  Tab Delimited (TSV)   2D SDfile   Computed 3D by Vconf -m prep SDfile
Find this compound or compounds like it in BindingDB:
Activity Spreadsheet -- Enzyme Inhibition Constant Data from BindingDB
Found 3 hits for monomerid = 52772
TargetZinc finger protein mex-5(Caenorhabditis elegans)
Broad Institute
Curated by PubChem BioAssay
LigandPNGBDBM52772((3Z)-3-[2-(4-methylphenyl)-2-oxidanylidene-ethylid...)
Affinity DataEC50:  3.00E+5nM. Assay description: Broad Institute: MLPCN maternal gene expression Project ID: 2024 Keywords: Zinc finger, C. elegans, maternal gene expression, RNA-protein interac...
In DepthDetails PCBioAssay
TargetCorticotropin-releasing factor-binding protein(Homo sapiens (Human))
Burnham Center For Chemical Genomics
Curated by PubChem BioAssay
LigandPNGBDBM52772((3Z)-3-[2-(4-methylphenyl)-2-oxidanylidene-ethylid...)
Affinity DataEC50:  1.14E+4nM. Assay description: Data Source: Sanford-Burnham Center for Chemical Genomics (SBCCG) Source Affiliation: Sanford-Burnham Medical Research Institute (SBMRI, San Diego, C...
In DepthDetails PCBioAssay
TargetPOsterior Segregation(Caenorhabditis elegans)
Broad Institute
Curated by PubChem BioAssay
LigandPNGBDBM52772((3Z)-3-[2-(4-methylphenyl)-2-oxidanylidene-ethylid...)
Affinity DataEC50:  3.00E+5nM. Assay description: Broad Institute: MLPCN maternal gene expression Project ID: 2024 Keywords: Zinc finger, C. elegans, maternal gene expression, RNA-protein interac...
In DepthDetails PCBioAssay