BDBM52814 (3Z)-2-(3-butyl-1-imidazol-3-iumyl)-3-(4-chlorophenyl)sulfonylimino-4-oxo-1-naphthalenolate::(3Z)-2-(3-butylimidazol-3-ium-1-yl)-3-(4-chlorophenyl)sulfonylimino-4-keto-naphthalen-1-olate::(3Z)-2-(3-butylimidazol-3-ium-1-yl)-3-(4-chlorophenyl)sulfonylimino-4-oxidanylidene-naphthalen-1-olate::(3Z)-2-(3-butylimidazol-3-ium-1-yl)-3-(4-chlorophenyl)sulfonylimino-4-oxonaphthalen-1-olate::MLS000767563::SMR000429893::cid_16411694
SMILES CCCC[n+]1ccn(c1)C1=C([N-]S(=O)(=O)c2ccc(Cl)cc2)C(=O)c2ccccc2C1=O
InChI Key InChIKey=ZARDQFVCGYZNMP-UHFFFAOYSA-N
Data  6 IC50  2 EC50
  Tab Delimited (TSV)   2D SDfile   Computed 3D by Vconf -m prep SDfile
Find this compound or compounds like it in BindingDB:
Activity Spreadsheet -- Enzyme Inhibition Constant Data from BindingDB
Found 8 hits for monomerid = 52814
TargetZinc finger protein mex-5(Caenorhabditis elegans)
Broad Institute
Curated by PubChem BioAssay
LigandPNGBDBM52814((3Z)-2-(3-butyl-1-imidazol-3-iumyl)-3-(4-chlorophe...)
Affinity DataEC50:  8.59E+4nM. Assay description: Broad Institute: MLPCN maternal gene expression Project ID: 2024 Keywords: Zinc finger, C. elegans, maternal gene expression, RNA-protein interac...
In DepthDetails PCBioAssay
TargetPOsterior Segregation(Caenorhabditis elegans)
Broad Institute
Curated by PubChem BioAssay
LigandPNGBDBM52814((3Z)-2-(3-butyl-1-imidazol-3-iumyl)-3-(4-chlorophe...)
Affinity DataEC50:  3.00E+5nM. Assay description: Broad Institute: MLPCN maternal gene expression Project ID: 2024 Keywords: Zinc finger, C. elegans, maternal gene expression, RNA-protein interac...
In DepthDetails PCBioAssay
TargetCaspase-3(Homo sapiens (Human))
Burnham Center For Chemical Genomics
Curated by PubChem BioAssay
LigandPNGBDBM52814((3Z)-2-(3-butyl-1-imidazol-3-iumyl)-3-(4-chlorophe...)
Affinity DataIC50:  5.57E+4nM. Assay description: Data Source: Sanford-Burnham Center for Chemical Genomics (SBCCG) Source Affiliation: Sanford-Burnham Medical Research Institute (SBMRI, San Diego, C...
In DepthDetails PCBioAssay
TargetApoptotic protease-activating factor 1(Homo sapiens (Human))
Burnham Center For Chemical Genomics
Curated by PubChem BioAssay
LigandPNGBDBM52814((3Z)-2-(3-butyl-1-imidazol-3-iumyl)-3-(4-chlorophe...)
Affinity DataIC50: >1.00E+5nM. Assay description: Data Source: Sanford-Burnham Center for Chemical Genomics (SBCCG) Source Affiliation: Sanford-Burnham Medical Research Institute (SBIMR, San Diego, C...
In DepthDetails PCBioAssay
TargetSentrin-specific protease 6(Homo sapiens (Human))
Burnham Center For Chemical Genomics
Curated by PubChem BioAssay
LigandPNGBDBM52814((3Z)-2-(3-butyl-1-imidazol-3-iumyl)-3-(4-chlorophe...)
Affinity DataIC50:  1.24E+4nM. Assay description: Data Source: Sanford-Burnham Center for Chemical Genomics (SBCCG) Source Affiliation: Sanford-Burnham Medical Research Institute (SBMRI, San Diego, C...
In DepthDetails PCBioAssay
TargetCaspase-9(Homo sapiens (Human))
Burnham Center For Chemical Genomics
Curated by PubChem BioAssay
LigandPNGBDBM52814((3Z)-2-(3-butyl-1-imidazol-3-iumyl)-3-(4-chlorophe...)
Affinity DataIC50:  2.01E+4nM. Assay description: Data Source: Sanford-Burnham Center for Chemical Genomics (SBCCG) Source Affiliation: Sanford-Burnham Medical Research Institute (SBIMR, San Diego, C...
In DepthDetails PCBioAssay
TargetApoptotic protease-activating factor 1(Homo sapiens (Human))
Burnham Center For Chemical Genomics
Curated by PubChem BioAssay
LigandPNGBDBM52814((3Z)-2-(3-butyl-1-imidazol-3-iumyl)-3-(4-chlorophe...)
Affinity DataIC50:  1.93E+4nM. Assay description: Data Source: Sanford-Burnham Center for Chemical Genomics (SBCCG) Source Affiliation: Sanford-Burnham Medical Research Institute (SBIMR, San Diego, C...
In DepthDetails PCBioAssay
TargetSentrin-specific protease 8(Homo sapiens (Human))
Burnham Center For Chemical Genomics
Curated by PubChem BioAssay
LigandPNGBDBM52814((3Z)-2-(3-butyl-1-imidazol-3-iumyl)-3-(4-chlorophe...)
Affinity DataIC50:  3.82E+4nM. Assay description: Data Source: Sanford-Burnham Center for Chemical Genomics (SBCCG) Source Affiliation: Sanford-Burnham Medical Research Institute (SBMRI, San Diego, C...
In DepthDetails PCBioAssay