BDBM52865 3-(2-Amino-3-cyano-pyrrolo[2,3-b]quinoxalin-1-yl)-benzoic acid::3-(2-amino-3-cyano-1-pyrrolo[3,2-b]quinoxalinyl)benzoic acid::3-(2-amino-3-cyano-pyrrolo[3,2-b]quinoxalin-1-yl)benzoic acid::3-(2-amino-3-cyanopyrrolo[3,2-b]quinoxalin-1-yl)benzoic acid::3-(2-azanyl-3-cyano-pyrrolo[3,2-b]quinoxalin-1-yl)benzoic acid::MLS000777297::SMR000413690::cid_700996
SMILES Nc1c(C#N)c2nc3ccccc3nc2n1-c1cccc(c1)C(O)=O
InChI Key InChIKey=VFGICKXXOMHSPW-UHFFFAOYSA-N
Data  3 EC50
  Tab Delimited (TSV)   2D SDfile   Computed 3D by Vconf -m prep SDfile
Find this compound or compounds like it in BindingDB:
Activity Spreadsheet -- Enzyme Inhibition Constant Data from BindingDB
Found 3 hits for monomerid = 52865
TargetZinc finger protein mex-5(Caenorhabditis elegans)
Broad Institute
Curated by PubChem BioAssay
LigandPNGBDBM52865(3-(2-Amino-3-cyano-pyrrolo[2,3-b]quinoxalin-1-yl)-...)
Affinity DataEC50:  3.00E+5nM. Assay description: Broad Institute: MLPCN maternal gene expression Project ID: 2024 Keywords: Zinc finger, C. elegans, maternal gene expression, RNA-protein interac...
In DepthDetails PCBioAssay
TargetCorticotropin-releasing factor-binding protein(Homo sapiens (Human))
Burnham Center For Chemical Genomics
Curated by PubChem BioAssay
LigandPNGBDBM52865(3-(2-Amino-3-cyano-pyrrolo[2,3-b]quinoxalin-1-yl)-...)
Affinity DataEC50:  1.37E+4nM. Assay description: Data Source: Sanford-Burnham Center for Chemical Genomics (SBCCG) Source Affiliation: Sanford-Burnham Medical Research Institute (SBMRI, San Diego, C...
In DepthDetails PCBioAssay
TargetPOsterior Segregation(Caenorhabditis elegans)
Broad Institute
Curated by PubChem BioAssay
LigandPNGBDBM52865(3-(2-Amino-3-cyano-pyrrolo[2,3-b]quinoxalin-1-yl)-...)
Affinity DataEC50:  3.00E+5nM. Assay description: Broad Institute: MLPCN maternal gene expression Project ID: 2024 Keywords: Zinc finger, C. elegans, maternal gene expression, RNA-protein interac...
In DepthDetails PCBioAssay