BDBM5294 3,6-diarylpyrazolo[1,5-a]pyrimidine 1::6-(4-methoxyphenyl)-3-phenylpyrazolo[1,5-a]pyrimidine::dorsomorphin (6LP)::pyrazolo[1,5-a]pyrimidine 2f
SMILES COc1ccc(cc1)-c1cnc2c(cnn2c1)-c1ccccc1
InChI Key InChIKey=QQGBJEHPZWGQFD-UHFFFAOYSA-N
Data  2 IC50  3 EC50
  Tab Delimited (TSV)   2D SDfile   Computed 3D by Vconf -m prep SDfile
Find this compound or compounds like it in BindingDB:
Activity Spreadsheet -- Enzyme Inhibition Constant Data from BindingDB
Found 5 hits for monomerid = 5294
TargetVascular endothelial growth factor receptor 2(Homo sapiens (Human))
Merck Research Laboratories
LigandPNGBDBM5294(3,6-diarylpyrazolo[1,5-a]pyrimidine 1 | 6-(4-metho...)
Affinity DataIC50:  71nMpH: 7.4 T: 2°C. Assay description: Activated KDR was incubated with 25 uM/10 uCi of [gamma-33P] ATP, poly-Glu/Tyr, and inhibitors in kinase buffer for 15 min at 22 °C. The reactio...
In DepthDetails ArticlePubMed
TargetVascular endothelial growth factor receptor 2(Homo sapiens (Human))
Merck Research Laboratories
LigandPNGBDBM5294(3,6-diarylpyrazolo[1,5-a]pyrimidine 1 | 6-(4-metho...)
Affinity DataIC50:  71nMpH: 7.4 T: 2°C. Assay description: Activated KDR was incubated with 25 uM/10 uCi of [gamma-33P] ATP, poly-Glu/Tyr, and inhibitors in kinase buffer for 15 min at 22 °C. The reactio...
In DepthDetails ArticlePubMed
TargetReceptor protein serine/threonine kinase(Danio rerio (Zebrafish))
Vanderbilt University
LigandPNGBDBM5294(3,6-diarylpyrazolo[1,5-a]pyrimidine 1 | 6-(4-metho...)
Affinity DataEC50: >5.00E+4nM. Assay description: For nonspecific toxicity, the EC100 represents the concentration when 100% of the treated embryos exhibit either early lethality within hours of comp...
In DepthDetails ArticlePubMed
TargetReceptor protein serine/threonine kinase(Danio rerio (Zebrafish))
Vanderbilt University
LigandPNGBDBM5294(3,6-diarylpyrazolo[1,5-a]pyrimidine 1 | 6-(4-metho...)
Affinity DataEC50: >5.00E+4nM. Assay description: For ISV disruption, the EC50 represents the concentration when the formation of about 50% of the ISVs is inhibited.
In DepthDetails ArticlePubMed
TargetReceptor protein serine/threonine kinase(Danio rerio (Zebrafish))
Vanderbilt University
LigandPNGBDBM5294(3,6-diarylpyrazolo[1,5-a]pyrimidine 1 | 6-(4-metho...)
Affinity DataEC50: >5.00E+4nM. Assay description: The effects on zebrafish embryos with respect to the dorsoventral (DV) axis. For dorsalization, the EC100 (effective concentration 100%) represents t...
In DepthDetails ArticlePubMed