BDBM52971 (3-butyl-7-methyl-6,8-dioxoisochromen-7-yl) thiophene-2-carboxylate::2-thiophenecarboxylic acid (3-butyl-7-methyl-6,8-dioxo-2-benzopyran-7-yl) ester::CMLD003375::MLS000438332::SMR000452565::[3-butyl-7-methyl-6,8-bis(oxidanylidene)isochromen-7-yl] thiophene-2-carboxylate::cid_16759448::thiophene-2-carboxylic acid (3-butyl-6,8-diketo-7-methyl-isochromen-7-yl) ester
SMILES CCCCC1=CC2=CC(=O)C(C)(OC(=O)c3cccs3)C(=O)C2=CO1
InChI Key InChIKey=ITAOWTIRVWJJKZ-UHFFFAOYSA-N
Data  1 IC50  2 EC50
  Tab Delimited (TSV)   2D SDfile   Computed 3D by Vconf -m prep SDfile
Find this compound or compounds like it in BindingDB:
Activity Spreadsheet -- Enzyme Inhibition Constant Data from BindingDB
Found 3 hits for monomerid = 52971
TargetPOsterior Segregation(Caenorhabditis elegans)
Broad Institute
Curated by PubChem BioAssay
LigandPNGBDBM52971((3-butyl-7-methyl-6,8-dioxoisochromen-7-yl) thioph...)
Affinity DataEC50:  3.54E+4nM. Assay description: Broad Institute: MLPCN maternal gene expression Project ID: 2024 Keywords: Zinc finger, C. elegans, maternal gene expression, RNA-protein interac...
In DepthDetails PCBioAssay
TargetProbable nicotinate-nucleotide adenylyltransferase(Staphylococcus aureus subsp. aureus N315)
Burnham Center For Chemical Genomics
Curated by PubChem BioAssay
LigandPNGBDBM52971((3-butyl-7-methyl-6,8-dioxoisochromen-7-yl) thioph...)
Affinity DataIC50:  3.44E+4nM
In DepthDetails PCBioAssay
TargetZinc finger protein mex-5(Caenorhabditis elegans)
Broad Institute
Curated by PubChem BioAssay
LigandPNGBDBM52971((3-butyl-7-methyl-6,8-dioxoisochromen-7-yl) thioph...)
Affinity DataEC50:  3.09E+4nM. Assay description: Broad Institute: MLPCN maternal gene expression Project ID: 2024 Keywords: Zinc finger, C. elegans, maternal gene expression, RNA-protein interac...
In DepthDetails PCBioAssay