BDBM53022 (E)-3-(2,6-dichlorophenyl)-1-(4-morpholinyl)-2-propen-1-one::(E)-3-(2,6-dichlorophenyl)-1-morpholin-4-ylprop-2-en-1-one::(E)-3-(2,6-dichlorophenyl)-1-morpholino-prop-2-en-1-one::(E)-3-[2,6-bis(chloranyl)phenyl]-1-morpholin-4-yl-prop-2-en-1-one::4-[3-(2,6-dichlorophenyl)acryloyl]morpholine::MLS000974891::SMR000497550::cid_887263
SMILES Clc1cccc(Cl)c1\C=C\C(=O)N1CCOCC1
InChI Key InChIKey=JOCFGTSETGWADZ-SNAWJCMRSA-N
Data  2 EC50
  Tab Delimited (TSV)   2D SDfile   Computed 3D by Vconf -m prep SDfile
Find this compound or compounds like it in BindingDB:
Activity Spreadsheet -- Enzyme Inhibition Constant Data from BindingDB
Found 2 hits for monomerid = 53022
TargetZinc finger protein mex-5(Caenorhabditis elegans)
Broad Institute
Curated by PubChem BioAssay
LigandPNGBDBM53022((E)-3-(2,6-dichlorophenyl)-1-(4-morpholinyl)-2-pro...)
Affinity DataEC50:  3.00E+5nM. Assay description: Broad Institute: MLPCN maternal gene expression Project ID: 2024 Keywords: Zinc finger, C. elegans, maternal gene expression, RNA-protein interac...
In DepthDetails PCBioAssay
TargetPOsterior Segregation(Caenorhabditis elegans)
Broad Institute
Curated by PubChem BioAssay
LigandPNGBDBM53022((E)-3-(2,6-dichlorophenyl)-1-(4-morpholinyl)-2-pro...)
Affinity DataEC50:  3.00E+5nM. Assay description: Broad Institute: MLPCN maternal gene expression Project ID: 2024 Keywords: Zinc finger, C. elegans, maternal gene expression, RNA-protein interac...
In DepthDetails PCBioAssay