BDBM53077 MLS001211002::N-[(5Z)-5-(3-ethyl-1,3-benzothiazol-2-ylidene)-4-keto-2-thioxo-thiazolidin-3-yl]acetamide::N-[(5Z)-5-(3-ethyl-1,3-benzothiazol-2-ylidene)-4-oxidanylidene-2-sulfanylidene-1,3-thiazolidin-3-yl]ethanamide::N-[(5Z)-5-(3-ethyl-1,3-benzothiazol-2-ylidene)-4-oxo-2-sulfanylidene-1,3-thiazolidin-3-yl]acetamide::N-[(5Z)-5-(3-ethyl-1,3-benzothiazol-2-ylidene)-4-oxo-2-sulfanylidene-3-thiazolidinyl]acetamide::N-[5-(3-Ethyl-3H-benzothiazol-2-ylidene)-4-oxo-2-thioxo-thiazolidin-3-yl]-acetamide::SMR000513514::cid_3100655
SMILES CCN1\C(Sc2ccccc12)=C1\SC(=S)N(NC(C)=O)C1=O
InChI Key InChIKey=BKBSRADQVWKQDO-QBFSEMIESA-N
Data  2 EC50
  Tab Delimited (TSV)   2D SDfile   Computed 3D by Vconf -m prep SDfile
Find this compound or compounds like it in BindingDB:
Activity Spreadsheet -- Enzyme Inhibition Constant Data from BindingDB
Found 2 hits for monomerid = 53077
TargetZinc finger protein mex-5(Caenorhabditis elegans)
Broad Institute
Curated by PubChem BioAssay
LigandPNGBDBM53077(MLS001211002 | N-[(5Z)-5-(3-ethyl-1,3-benzothiazol...)
Affinity DataEC50:  3.00E+5nM. Assay description: Broad Institute: MLPCN maternal gene expression Project ID: 2024 Keywords: Zinc finger, C. elegans, maternal gene expression, RNA-protein interac...
In DepthDetails PCBioAssay
TargetPOsterior Segregation(Caenorhabditis elegans)
Broad Institute
Curated by PubChem BioAssay
LigandPNGBDBM53077(MLS001211002 | N-[(5Z)-5-(3-ethyl-1,3-benzothiazol...)
Affinity DataEC50:  6.07E+4nM. Assay description: Broad Institute: MLPCN maternal gene expression Project ID: 2024 Keywords: Zinc finger, C. elegans, maternal gene expression, RNA-protein interac...
In DepthDetails PCBioAssay