BDBM53137 2-amino-4-(7-methoxy-1,3-benzodioxol-5-yl)-5-oxo-4,6,7,8-tetrahydro-1-benzopyran-3-carbonitrile::2-amino-4-(7-methoxy-1,3-benzodioxol-5-yl)-5-oxo-4,6,7,8-tetrahydrochromene-3-carbonitrile::2-amino-5-keto-4-(7-methoxy-1,3-benzodioxol-5-yl)-4,6,7,8-tetrahydrochromene-3-carbonitrile::2-azanyl-4-(7-methoxy-1,3-benzodioxol-5-yl)-5-oxidanylidene-4,6,7,8-tetrahydrochromene-3-carbonitrile::MLS001165151::SMR000540344::cid_2837576
SMILES COc1cc(cc2OCOc12)C1C(C#N)C(=N)OC2=C1C(=O)CCC2
InChI Key InChIKey=FWGRTCGDKJQYGK-UHFFFAOYSA-N
Data  2 EC50
  Tab Delimited (TSV)   2D SDfile   Computed 3D by Vconf -m prep SDfile
Find this compound or compounds like it in BindingDB:
Activity Spreadsheet -- Enzyme Inhibition Constant Data from BindingDB
Found 2 hits for monomerid = 53137
TargetZinc finger protein mex-5(Caenorhabditis elegans)
Broad Institute
Curated by PubChem BioAssay
LigandPNGBDBM53137(2-amino-4-(7-methoxy-1,3-benzodioxol-5-yl)-5-oxo-4...)
Affinity DataEC50:  3.00E+5nM. Assay description: Broad Institute: MLPCN maternal gene expression Project ID: 2024 Keywords: Zinc finger, C. elegans, maternal gene expression, RNA-protein interac...
In DepthDetails PCBioAssay
TargetPOsterior Segregation(Caenorhabditis elegans)
Broad Institute
Curated by PubChem BioAssay
LigandPNGBDBM53137(2-amino-4-(7-methoxy-1,3-benzodioxol-5-yl)-5-oxo-4...)
Affinity DataEC50:  3.00E+5nM. Assay description: Broad Institute: MLPCN maternal gene expression Project ID: 2024 Keywords: Zinc finger, C. elegans, maternal gene expression, RNA-protein interac...
In DepthDetails PCBioAssay