BDBM5321 3-(5-Thien-3-ylpyridin-3-yl)-1Hindole 3d::4-(2-{3-[5-(thiophen-3-yl)pyridin-3-yl]-1H-indol-1-yl}ethyl)morpholine
SMILES C(Cn1cc(-c2cncc(c2)-c2ccsc2)c2ccccc12)N1CCOCC1
InChI Key InChIKey=JIMGURDGSPNGPQ-UHFFFAOYSA-N
Data  1 IC50
  Tab Delimited (TSV)   2D SDfile   Computed 3D by Vconf -m prep SDfile
Find this compound or compounds like it in BindingDB:
Activity Spreadsheet -- Enzyme Inhibition Constant Data from BindingDB
Found 1 hit for monomerid = 5321
TargetVascular endothelial growth factor receptor 2(Homo sapiens (Human))
Merck Research Laboratories
LigandPNGBDBM5321(3-(5-Thien-3-ylpyridin-3-yl)-1Hindole 3d | 4-(2-{3...)
Affinity DataIC50:  60nMpH: 7.4 T: 2°C. Assay description: Activated KDR was incubated with 25 uM/10 uCi of [gamma-33P] ATP, poly-Glu/Tyr, and inhibitors in kinase buffer for 15 min at 22 °C. The reactio...
In DepthDetails ArticlePubMed