BDBM53298 5-[[5-(4-morpholin-4-ylsulfonylphenyl)furan-2-yl]methylidene]-1,3-diazinane-2,4,6-trione::5-[[5-(4-morpholinosulfonylphenyl)-2-furyl]methylene]barbituric acid::5-[[5-[4-(4-morpholinylsulfonyl)phenyl]-2-furanyl]methylidene]-1,3-diazinane-2,4,6-trione::MLS000911618::SMR000718289::cid_24816494
SMILES O=[#6]-1-[#7]-[#6](=O)\[#6](=[#6]\c2ccc(o2)-c2ccc(cc2)S(=O)(=O)[#7]-2-[#6]-[#6]-[#8]-[#6]-[#6]-2)-[#6](=O)-[#7]-1
InChI Key InChIKey=FUQZTISWJHEKKX-UHFFFAOYSA-N
Data  2 EC50
  Tab Delimited (TSV)   2D SDfile   Computed 3D by Vconf -m prep SDfile
Find this compound or compounds like it in BindingDB:
Activity Spreadsheet -- Enzyme Inhibition Constant Data from BindingDB
Found 2 hits for monomerid = 53298
TargetZinc finger protein mex-5(Caenorhabditis elegans)
Broad Institute
Curated by PubChem BioAssay
LigandPNGBDBM53298(5-[[5-(4-morpholin-4-ylsulfonylphenyl)furan-2-yl]m...)
Affinity DataEC50:  3.47E+4nM. Assay description: Broad Institute: MLPCN maternal gene expression Project ID: 2024 Keywords: Zinc finger, C. elegans, maternal gene expression, RNA-protein interac...
In DepthDetails PCBioAssay
TargetPOsterior Segregation(Caenorhabditis elegans)
Broad Institute
Curated by PubChem BioAssay
LigandPNGBDBM53298(5-[[5-(4-morpholin-4-ylsulfonylphenyl)furan-2-yl]m...)
Affinity DataEC50:  4.05E+4nM. Assay description: Broad Institute: MLPCN maternal gene expression Project ID: 2024 Keywords: Zinc finger, C. elegans, maternal gene expression, RNA-protein interac...
In DepthDetails PCBioAssay